{"text_format":"1","workbook":"xlsx","n_sheets":10,"sheets":["OVERALL RATING (avg)","Clean Air","Efficiency","Greenhouse","RESULTS","SPECS","LIMITS Clean Air","LIMITS Efficiency","LIMITS Greenhouse","WEBSITE SUMMARY"],"not_rendered":{"charts":0,"images":13,"macros":1,"external_links":0,"defined_names":19,"comments":2,"pivot_tables":0},"unopened":[],"bounds":{"document_bytes":16777216,"sheet_cells":100000,"rows_first":2000,"rows_last":500,"rows_between":2000,"halvings":0,"cell_chars":16384,"cell_head_chars":4096},"cells_cut":0,"cells_raw":0,"read":"whole","date_system":"1900"}

{"sheet":"OVERALL RATING (avg)","index":0,"n_rows":70,"n_cols":17,"rows_kept":70,"cut":false,"hidden":false,"merged":[[69,6,69,7],[48,3,48,8],[49,4,49,5],[49,6,49,8],[50,7,50,8],[51,4,51,5],[51,6,51,8],[53,4,53,5],[53,6,53,8],[54,3,54,5],[54,6,54,8],[55,6,55,7],[56,6,56,7],[57,6,57,7],[58,3,58,5],[58,6,58,8],[65,6,65,7],[66,3,66,5],[66,6,66,8],[67,6,67,7],[68,6,68,7],[61,6,61,7],[62,3,62,5],[62,6,62,8],[63,6,63,7],[64,6,64,7],[59,6,59,7],[60,6,60,7],[54,15,54,18],[56,15,56,18],[2,1,3,1],[2,2,3,2],[21,2,21,4],[21,5,21,7],[6,2,6,4],[6,5,6,7],[9,1,13,1],[15,1,18,1],[41,2,41,4],[42,5,42,7],[6,8,6,10],[21,8,21,10],[41,8,41,10],[42,8,42,10],[41,5,41,7],[42,2,42,4],[22,2,22,4],[22,5,22,7],[22,8,22,10],[23,2,23,10],[40,5,40,7],[40,8,40,10],[40,2,40,4],[43,8,43,10],[44,8,44,10],[44,5,44,7],[44,2,44,4],[43,5,43,7],[43,2,43,4]]}
[]
[]
[null,{"$f":"CONCATENATE(E50,\" \",H50)","v":"0 "}]
[]
[]
[]
[null,null,"Clean Air Index\n",null,null,"Energy Efficiency Index\n",null,null,"Greenhouse Gas Index\n"]
[]
[null,null,32.6,"CD mode","CS mode",40.5,"CD mode","CS mode",null,"CD mode","CS mode"]
[null,"Standard Testing",{"$f":"'Clean Air'!B6","v":"WLTC+ warm engine"},{"$f":"IF('Clean Air'!$H$14=0,\"-\",'Clean Air'!$H$14)","v":"-"},{"$f":"'Clean Air'!F14","v":10},{"$f":"C10","v":"WLTC+ warm engine"},"-",{"$f":"SUM(Efficiency!F12:F14)","v":10},{"$f":"F10","v":"WLTC+ warm engine"},"-",{"$f":"Greenhouse!F32","v":10}]
{"$rows_left_out":61}
{"sheet":"Clean Air","index":1,"n_rows":106,"n_cols":33,"rows_kept":106,"cut":false,"hidden":false,"merged":[[4,1,4,2],[97,5,97,6],[97,9,98,9],[99,9,100,9],[99,7,99,8],[100,7,100,8],[40,1,40,2],[100,1,100,2],[98,1,98,2],[97,3,97,4],[58,1,58,3],[85,1,85,2],[95,1,95,2],[97,1,97,2],[99,1,99,2],[101,1,101,2],[69,11,75,11],[78,11,84,11],[1,10,3,10],[22,1,22,2],[1,4,1,5],[2,4,2,5],[1,6,1,7],[2,6,2,7],[1,8,2,9],[1,1,2,2],[3,1,3,2],[13,1,13,2],[67,1,67,2],[76,1,76,2],[97,7,98,8]]}
[null,null,null,null,null,null,null,null,null,null,null,null,null,null,null,null,null,null,1]
[null,"1. Clean Air Index",null,null,"Test Results",null,"Test Results",null,"Thresholds",null,"Max score"]
[null,null,null,null,"CS mode",null,"CD mode"]
[null,null,null,null,"Value","Points","Value","Points","lower","upper"]
[null,"Standard",null,"Weighting",{"$f":"Sliding_Scale(RESULTS!Z26,'LIMITS Clean Air'!H32,'LIMITS Clean Air'!H33,'LIMITS Clean Air'!$H$34,(1-'LIMITS Clean Air'!$H$34),2)","v":0.8},null,{"$f":"1-E5","v":0.19999999999999996}]
[null,"WLTC+ warm engine",null,"max points",null,{"$f":"SUM(K7:K13)","v":10}]
[null,null,"NMHC","mg/km",{"$f":"RESULTS!$O$8-RESULTS!$P$8","v":0},{"$f":"Sliding_Scale(E7,I7,J7,K7,0,Slide_Type)","v":2},null,null,{"$f":"'LIMITS Clean Air'!$D$20","v":0.5},{"$f":"'LIMITS Clean Air'!$D$6","v":58},2]
[null,null,"NOx","mg/km",{"$f":"RESULTS!$H$8","v":0},{"$f":"Sliding_Scale(E8,I8,J8,K8,0,Slide_Type)","v":3},null,null,{"$f":"'LIMITS Clean Air'!$D$21","v":0.5},{"$f":"'LIMITS Clean Air'!$D$7","v":60},3]
[null,null,"NO2","mg/km",{"$f":"RESULTS!$J$8","v":0},{"$f":"Sliding_Scale(E9,I9,J9,K9,0,Slide_Type)","v":0},null,null,{"$f":"'LIMITS Clean Air'!$D$22","v":0},{"$f":"'LIMITS Clean Air'!$D$8","v":20},0]
[null,null,"NH3","mg/km",{"$f":"RESULTS!$N$8","v":0},{"$f":"Sliding_Scale(E10,I10,J10,K10,0,Slide_Type)","v":1},null,null,{"$f":"'LIMITS Clean Air'!$D$23","v":0.1},{"$f":"'LIMITS Clean Air'!$D$9","v":10},1]
{"$rows_left_out":97}
{"sheet":"Efficiency","index":2,"n_rows":115,"n_cols":31,"rows_kept":115,"cut":false,"hidden":false,"merged":[[28,6,28,7],[28,8,28,9],[22,10,23,10],[24,8,24,9],[22,6,22,7],[24,10,25,10],[25,8,25,9],[22,8,23,9],[26,1,26,2],[22,1,22,2],[22,4,22,5],[28,1,28,5],[23,1,23,3],[24,1,24,3],[25,1,25,3],[1,10,3,10],[1,1,2,2],[18,1,18,2],[1,4,1,5],[1,6,1,7],[2,4,2,5],[2,6,2,7],[3,1,3,2],[1,8,1,9]]}
[]
[null,"2. Efficiency",null,null,"Test Results",null,"Test Results",null,"Thresholds"]
[null,null,null,null,"CS mode",null,"CD mode"]
[]
[null,null,null,"Weighting",{"$f":"'Clean Air'!E5","v":0.8},null,{"$f":"'Clean Air'!G5","v":0.19999999999999996}]
[null,"2.1","Test cycle measurements",null,"Value","Points","Value","Points","Lower","Upper","Max score"]
[]
[null,"2.1.2","Energy Consumption (total)"]
[null,null,"max points",50,"Value","Points","Value","Points","Lower","Upper","Max score",null,null,"Scored"]
[null,"Standard",{"$f":"RESULTS!D4","v":"WLTC+ cold engine (23°C)"},"kWh/100km",{"$f":"Z25+AC25","v":0},{"$f":"MAX(0,Sliding_Scale(E10,I10,J10,K10,0,Slide_Type))","v":10},{"$f":"Z67+AC67","v":0},{"$f":"MAX(0,Sliding_Scale(G10,I10,J10,K10,0,Slide_Type))","v":10},{"$f":"'LIMITS Efficiency'!E6","v":20},{"$f":"'LIMITS Efficiency'!F6","v":90},10,null,"Averaged",{"$f":"F10*$E$5+H10*$G$5","v":10}]
{"$rows_left_out":106}
{"sheet":"Greenhouse","index":3,"n_rows":53,"n_cols":26,"rows_kept":53,"cut":false,"hidden":false,"merged":[[52,8,52,9],[48,9,49,9],[46,1,46,2],[47,1,47,2],[48,1,48,2],[49,1,49,2],[46,4,46,5],[46,6,46,7],[50,1,50,2],[52,1,52,2],[52,6,52,7],[46,8,47,8],[46,9,47,9],[42,1,42,2],[31,1,31,2],[22,1,22,2],[21,17,21,25],[23,17,23,18],[23,20,23,21],[23,23,23,24],[33,17,33,25],[3,1,3,2],[1,1,2,2],[1,8,2,9],[1,10,3,10],[13,1,13,2],[1,6,1,7],[1,4,1,5],[2,4,2,5],[2,6,2,7],[4,17,4,25],[6,17,6,18],[6,20,6,21],[6,23,6,24],[16,17,16,25]]}
[null,null,null,null,null,null,null,null,null,null,null,null,null,null,null,null,null,1]
[null,"3.Greenhouse gasses",null,null,"Test Results",null,"Test Results",null,"Thresholds",null,"Max score"]
[null,null,null,null,"CS mode",null,"CD mode",null,null,null,null,null,null,null,null,null,null,"3.2 Charge Sustaining Mode"]
[null,null,null,null,"Value","Points","Value","Points","Lower","Upper",null,null,null,null,null,null,null,"Conversion from local consumption kWh/100km to upstream GHG emissions in g/km for different energy carriers"]
[null,"3.1","Weighting",null,{"$f":"'Clean Air'!E5","v":0.8},null,{"$f":"'Clean Air'!G5","v":0.19999999999999996},null,null,null,null,null,{"$f":"B6","v":"WLTC+ cold engine (23°C)"},null,null,null,null,"CO2 equivalent upstream (Well-to-Tank+)"]
[null,{"$f":"RESULTS!D4","v":"WLTC+ cold engine (23°C)"},"max points",null,null,{"$f":"K9","v":10},null,{"$f":"K9","v":10},null,null,null,null,"Averaged","max points",10,null,null,"Liquid Fuel",null,"Factor","Electricity",null,"Factor","Gaseous Fuel",null,"Factor"]
[null,"Standard","N2O tailpipe","mg/km",{"$f":"RESULTS!$M$4","v":0},{"$f":"IF(E7<=J7,K7,0)","v":0.5},{"$f":"RESULTS!$M$26","v":0},{"$f":"IF(G7<=J7,K7,0)","v":0.5},{"$f":"'LIMITS Greenhouse'!$E$12","v":0},{"$f":"'LIMITS Greenhouse'!$D$6","v":10},0.5,null,"N2O tailpipe","scored",{"$f":"$E$5*F7+$G$5*H7","v":0.5},null,null,{"$f":"IF(Petrol_PHEV,\"Petrol\",IF(Diesel_PHEV,\"Diesel\",\"-\"))","v":"Petrol"},null,{"$f":"IF(Petrol_PHEV,'LIMITS Greenhouse'!$D$21,IF(Diesel_PHEV,'LIMITS Greenhouse'!$D$22,0))","v":0.85607812995876598},{"$f":"IF(OR(Petrol_PHEV,Diesel_PHEV),\"Electricity\",\"-\")","v":"Electricity"},null,{"$f":"IF(OR(Petrol_PHEV,Diesel_PHEV),'LIMITS Greenhouse'!D23,0)","v":2.8202228762269628}]
[null,null,"CH4 tailpipe","mg/km",{"$f":"RESULTS!$P$4","v":0},{"$f":"IF(E8<=J8,K8,0)","v":0.5},{"$f":"RESULTS!$P$26","v":0},{"$f":"IF(G8<=J8,K8,0)","v":0.5},{"$f":"'LIMITS Greenhouse'!$E$13","v":0},{"$f":"'LIMITS Greenhouse'!$D$7","v":32},0.5,null,"CH4 tailpipe","scored",{"$f":"$E$5*F8+$G$5*H8","v":0.5},null,null,{"$f":"Efficiency!$C$10","v":"WLTC+ cold engine (23°C)"},"g/km",{"$f":"Efficiency!Z25*T$7","v":0},{"$f":"Efficiency!$C$10","v":"WLTC+ cold engine (23°C)"},"g/km",{"$f":"Efficiency!AC25*$W$7","v":0},{"$f":"Efficiency!$C$10","v":"WLTC+ cold engine (23°C)"},"g/km",{"$f":"Efficiency!AF25*Greenhouse!$Z$7","v":0}]
[null,null,"Total CO2 equivalent","g/km",{"$f":"SUM(E10:E13)","v":0},{"$f":"Sliding_Scale(E9,I9,J9,K9,0,Slide_Type)","v":10},{"$f":"SUM(G10:G13)","v":0},{"$f":"Sliding_Scale(G9,I9,J9,K9,0,Slide_Type)","v":10},{"$f":"'LIMITS Greenhouse'!$E$16","v":50},{"$f":"'LIMITS Greenhouse'!$N$8","v":225},10,null,"Total CO2 equivalent","scored",{"$f":"$E$5*F9+$G$5*H9","v":10},null,null,{"$f":"Efficiency!$C$11","v":"WLTC+ CAT (-7°C)"},"g/km",{"$f":"Efficiency!Z26*T$7","v":0},{"$f":"Efficiency!$C$11","v":"WLTC+ CAT (-7°C)"},"g/km",{"$f":"Efficiency!AC26*$W$7","v":0},{"$f":"Efficiency!$C$11","v":"WLTC+ CAT (-7°C)"},"g/km",{"$f":"Efficiency!AF26*Greenhouse!$Z$7","v":0}]
[null,null,"CO2 tailpipe","g/km",{"$f":"RESULTS!$F$4","v":0},null,{"$f":"RESULTS!$F$26","v":0},null,null,null,null,null,"CO2 tailpipe",null,null,null,null,{"$f":"Efficiency!$C$12","v":"WLTC+ warm engine"},"g/km",{"$f":"Efficiency!Z27*T$7","v":0},{"$f":"Efficiency!$C$12","v":"WLTC+ warm engine"},"g/km",{"$f":"Efficiency!AC27*$W$7","v":0},{"$f":"Efficiency!$C$12","v":"WLTC+ warm engine"},"g/km",{"$f":"Efficiency!AF27*Greenhouse!$Z$7","v":0}]
{"$rows_left_out":44}
{"sheet":"RESULTS","index":4,"n_rows":46,"n_cols":29,"rows_kept":46,"cut":false,"hidden":false,"merged":[[41,1,43,1],[42,2,42,3],[43,2,43,3],[23,0,43,0],[1,0,21,0],[32,1,40,1],[25,1,31,1],[10,1,18,1],[3,1,9,1],[34,2,35,2],[12,2,13,2],[25,2,28,2],[29,2,31,2],[3,2,6,2],[7,2,9,2],[1,1,1,3],[36,2,40,2],[32,2,33,2],[10,2,11,2],[23,1,23,3],[14,2,18,2],[19,1,21,1],[19,2,19,3],[20,2,20,3],[21,2,21,3]]}
[]
["CHARGE SUSTAINING MODE","RESULTS CHARGE SUSTAINING MODE",null,null,"CO2\ntailpipe","CO2                RCB corr.","CO","NOx","NO","NO2","PN","PM","N2O","NH3","THC","CH4","Fuel Consumption","Energy Consumption from Grid","Fuel consumpt.","Energy consumpt.","Gas Consumption","Board Comp.\n fuel consumpt.","Board Comp.\n energy consumpt.","Board Comp.\ngas consumpt.","Driving Range\n(ICE mode)","Driving Range\n(electr. mode)\nEAER","Gross Battery Capacity (from grid)","Measured Netto Battery Capacity"]
[null,null,null,null,"g/km","g/km","mg/km","mg/km","mg/km","mg/km","#/km","mg/km","mg/km","mg/km","mg/km","mg/km","l/100km","kWh/100km","g/s","Wh/s","kg/100km","l/100km","kWh/100km","kg/100km","km","km","kWh","kWh"]
[null,"Laboratory Tests","WLTC+ appr.","WLTC+ cold engine (23°C)",null,null,null,null,null,null,null,null,null,null,null,null,null,null,"n.a.","n.a.",null,null,null,null,null,"n.a."]
[null,null,null,"WLTC+ cold engine 2 (not rated)",null,null,null,null,null,null,null,null,null,null,null,null,null,null,null,null,null,null,null,null,null,"n.a."]
[null,null,null,"WLTC+ cold engine average (not rated)",null,null,null,null,null,null,null,null,null,null,null,null,null,null,null,null,null,null,null,null,null,"n.a."]
[null,null,null,"WLTC+ CAT (-7°C)",null,null,null,null,null,null,null,null,null,null,null,null,null,null,"n.a.","n.a.",null,null,null,null,null,"n.a."]
[null,null,"Robustness","WLTC+ warm engine",null,null,null,null,null,null,null,null,null,null,null,null,null,null,"n.a.","n.a.",null,null,null,null,null,"n.a."]
[null,null,null,"WLTC+ reg. warm engn. rep. (not rated)",null,null,null,null,null,null,null,null,null,null,null,null,null,null,null,null,null,null,null,null,null,"n.a."]
[null,null,null,"BAB130 Motorway",null,null,null,null,null,null,null,null,null,null,null,null,null,null,"n.a.","n.a.",null,null,null,null,null,"n.a."]
{"$rows_left_out":37}
{"sheet":"SPECS","index":5,"n_rows":46,"n_cols":21,"rows_kept":46,"cut":false,"hidden":false,"merged":[]}
["Brand",null,"CoC p.0.1. (e.g. Mercedes-Benz)",null,null,null,null,null,null,null,null,"Petrol PHEV",{"$f":"IF(ICE_Type=1,TRUE,FALSE)","v":true},1,"Version","Euro 6b"]
["Model",null,"CoC p.0.2.1. (e.g. V-Class)",null,null,null,null,null,null,null,null,"Diesel PHEV",{"$f":"IF(ICE_Type=2,TRUE,FALSE)","v":false},true,"2022v1.4","Euro 6c"]
["Variant Name",null,"Model data (e.g. V250d, 9G-Tronic, Avantgarde)",null,null,null,null,null,null,null,null,null,{"$f":"COUNTIF(EngineType,\"False\")","v":1},null,null,"Euro 6d-Temp"]
["Green NCAP Test Reference Number",null,"(e.g. 20-FOR-0023)",null,null,null,null,null,null,null,null,null,null,null,null,"Euro 6d"]
["Drivetrain (FWD/AWD/RWD/4WD)",null,"CoC p.3. (e.g. RWD)",null,null,null,null,null,null,null,null,null,null,null,null,"Euro AX"]
["Fuel Type"]
["Primary fuel source"]
["Secondary fuel source (if applicable)"]
["Fuel tank size liquid fuel [l]",null,"Tech data (e.g. 70 l)"]
["Fuel tank size gaseous fuel [kg]",null,"Tech data (e.g. 15 kg)"]
{"$rows_left_out":37}
{"sheet":"LIMITS Clean Air","index":6,"n_rows":34,"n_cols":17,"rows_kept":34,"cut":false,"hidden":false,"merged":[[33,5,33,6],[30,5,30,7],[1,1,1,12],[3,2,3,3],[3,6,3,7],[3,10,3,11],[3,14,3,16],[8,14,8,16],[14,10,14,11],[15,10,15,11],[17,2,18,3],[17,6,18,7],[17,10,18,11],[17,14,18,15]]}
[]
[null,"Clean Air (Pollutants)"]
[]
[null,null,"Upper Thresholds (labtests \nw/o WLTC+ CAT (-7°C))",null,"gross excess",null,"Upper Thresholds\n(PEMS+ tests)",null,"gross excess",null,"Upper Thresholds\n WLTC+ CAT (-7°C)\n (extended bouderies)",null,"gross excess",null,"Congestion Simulation\nUpper Thresholds"]
[null,null,null,null,null,null,null,null,null,null,null,null,null,null,null,"Max","Average"]
[null,null,"NMHC",{"$f":"90-32","v":58},{"$f":"1.5*D6","v":87},null,"NMHC",{"$f":"D6*$I$14","v":76.56},{"$f":"1.5*H6","v":114.84},null,"NMHC",{"$f":"D6*$M$14","v":76.56},{"$f":"1.5*L6","v":114.84},null,null,"mg/s","mg/s"]
[null,null,"NOx",60,{"$f":"1.5*D7","v":90},null,"NOx",79.2,{"$f":"1.5*H7","v":118.80000000000001},null,"NOx",79.2,{"$f":"1.5*L7","v":118.80000000000001},null,"NOx",1,0.5]
[null,null,"NO2",20,{"$f":"1.5*D8","v":30},null,"NO2",26.400000000000002,39.6,null,"NO2",26.400000000000002,39.6]
[null,null,"NH3",10,15,null,"NH3",13.200000000000001,19.8,null,"NH3",13.200000000000001,19.8,null,"Eligible for Stage 2 (Clean Air Only)"]
[null,null,"CO",500,750,null,"CO",660,990,null,"CO",660,990,null,"score",{"$f":"'Clean Air'!H100","v":10},{"$f":"'Clean Air'!J100","v":"YES"}]
{"$rows_left_out":25}
{"sheet":"LIMITS Efficiency","index":7,"n_rows":27,"n_cols":6,"rows_kept":27,"cut":false,"hidden":false,"merged":[[1,1,1,5],[15,1,15,5],[3,1,3,5],[16,1,16,5],[24,1,24,3]]}
[]
[null,"Energy Efficiency"]
[]
[null,"Energy Consumption Thresholds"]
[null,null,null,null,"Lower","Upper"]
[null,null,{"$f":"RESULTS!D4","v":"WLTC+ cold engine (23°C)"},"kWh/100km",20,90]
[null,null,{"$f":"RESULTS!D7","v":"WLTC+ CAT (-7°C)"},"kWh/100km",{"$f":"E6","v":20},{"$f":"F6","v":90}]
[null,null,{"$f":"RESULTS!D8","v":"WLTC+ warm engine"},"kWh/100km",{"$f":"E7","v":20},{"$f":"F7","v":90}]
[null,null,{"$f":"RESULTS!D10","v":"BAB130 Motorway"},"kWh/100km",20,90]
[null,null,{"$f":"RESULTS!D11","v":"PEMS+ cold engine 1"},"kWh/100km",20,90]
{"$rows_left_out":18}
{"sheet":"LIMITS Greenhouse","index":8,"n_rows":32,"n_cols":16,"rows_kept":32,"cut":false,"hidden":false,"merged":[[3,2,3,4],[3,7,3,9],[11,2,11,4],[11,8,11,10],[11,13,11,15],[14,13,14,14],[15,13,15,14],[25,1,25,2],[24,1,24,2],[15,2,15,3],[18,6,18,8],[18,1,18,3],[19,1,19,3],[20,1,20,2],[21,1,21,2],[22,1,22,2],[23,1,23,2],[14,2,14,3],[27,1,28,3],[29,1,29,3],[30,1,30,2],[31,1,31,2],[1,1,1,15],[16,8,16,9],[12,8,12,10],[13,8,13,9],[14,8,14,9],[16,2,16,3],[16,13,16,14],[12,13,12,15],[12,2,12,4],[13,2,13,3],[13,13,13,14],[15,8,15,9]]}
[]
[null,"Greenhouse gases"]
[]
[null,"GWP","Upper Thresholds (labtests w/o WLTC+ CAT (-7°C))",null,null,"gross excess",null,"Upper Thresholds (PEMS+ tests)",null,null,"gross excess",null,"Upper Thresholds (WLTC+ CAT (-7°C))",null,null,"gross excess"]
[]
[null,298,"N2O mg/km",10,10,{"$f":"1.5*D6","v":15},null,"N2O mg/km",{"$f":"D6*$K$10","v":15},null,22.5,null,"N2O mg/km",{"$f":"D6*$P$10","v":16},{"$f":"E6*$P$10","v":16},24]
[null,25,"CH4 mg/km ",32,32,{"$f":"1.5*D7","v":48},null,"CH4 mg/km ",48,null,72,null,"CH4 mg/km ",{"$f":"D7*$P$10","v":51.2},{"$f":"E7*$P$10","v":51.2},76.800000000000011]
[null,1,"CO2 g/km",225,225,{"$f":"1.5*D8","v":337.5},null,"CO2 g/km",337.5,null,337.5,null,"CO2 g/km",{"$f":"D8","v":225},{"$f":"E8","v":225},337.5]
[]
[null,null,null,null,null,null,null,null,null,"CF:",1.5,null,null,null,"CF:",1.6]
{"$rows_left_out":23}
{"sheet":"WEBSITE SUMMARY","index":9,"n_rows":167,"n_cols":4,"rows_kept":167,"cut":false,"hidden":true,"merged":[]}
["Car Model",{"$f":"CONCATENATE(SPECS!B1,\" \",SPECS!B2)","v":" "},null,"Type"]
["Type",{"$f":"SPECS!B3","v":0}]
["Release Date"]
["Year of Test",2022]
["Engine",{"$f":"SPECS!B6","v":0}]
["Gearbox",{"$f":"SPECS!B21","v":0}]
["Emissions Class",{"$f":"SPECS!B25","v":0}]
["Stars",{"$f":"Stars","v":5}]
["Test #",{"$f":"SPECS!B4","v":0}]
["Engine Size 2",{"$f":"SPECS!B27","v":0}]
{"$rows_left_out":157}