{"text_format":"1","workbook":"xlsx","n_sheets":10,"sheets":["OVERALL RATING","Clean Air","Efficiency","Greenhouse","RESULTS","SPECS","LIMITS Clean Air","LIMITS Efficiency","LIMITS Greenhouse","WEBSITE SUMMARY"],"not_rendered":{"charts":1,"images":14,"macros":1,"external_links":0,"defined_names":18,"comments":0,"pivot_tables":0},"unopened":[],"bounds":{"document_bytes":16777216,"sheet_cells":100000,"rows_first":2000,"rows_last":500,"rows_between":2000,"halvings":0,"cell_chars":16384,"cell_head_chars":4096},"cells_cut":0,"cells_raw":0,"read":"whole","date_system":"1900"}

{"sheet":"OVERALL RATING","index":0,"n_rows":61,"n_cols":12,"rows_kept":61,"cut":false,"hidden":false,"merged":[[59,5,59,6],[60,5,60,6],[54,5,54,6],[55,5,55,6],[56,5,56,6],[57,5,57,7],[40,6,40,7],[41,6,41,7],[42,6,42,7],[43,6,43,7],[58,5,58,6],[47,2,47,7],[48,3,48,4],[48,5,48,7],[49,6,49,7],[43,4,43,5],[40,4,40,5],[43,2,43,3],[42,4,42,5],[42,2,42,3],[41,2,41,3],[6,6,6,7],[7,6,7,7],[18,6,18,7],[19,6,19,7],[20,6,20,7],[2,1,3,1],[2,2,3,2],[20,2,20,3],[20,4,20,5],[52,3,52,4],[6,2,6,3],[6,4,6,5],[19,4,19,5],[7,2,7,3],[19,2,19,3],[18,2,18,3],[7,4,7,5],[18,4,18,5],[39,2,39,3],[40,2,40,3],[41,4,41,5],[53,12,53,15],[54,12,54,15],[53,2,53,4],[57,2,57,4],[50,3,50,4],[52,5,52,7],[53,5,53,7],[50,5,50,7],[21,2,21,3],[21,4,21,5],[21,6,21,7],[22,2,22,7],[39,4,39,5],[39,6,39,7]]}
[]
[]
[null,{"$f":"CONCATENATE(D49,\" \",F49)","v":"0 0"}]
[]
[]
[]
[null,null,"Clean Air Index\n",null,"Energy Efficiency Index\n",null,"Greenhouse Gas Index\n"]
[null,null,32.6,null,40.5]
[null,null,{"$f":"'Clean Air'!B6","v":"WLTC"},{"$f":"'Clean Air'!F14","v":10},"Energy Consumption \n(WLTC-cold  14o C)",{"$f":"Efficiency!F10","v":10},{"$f":"Greenhouse!B6","v":"WLTC"},{"$f":"Greenhouse!F12","v":7}]
[null,null,{"$f":"'Clean Air'!B15","v":"WLTC-CAT"},{"$f":"'Clean Air'!$F$23","v":10},"Energy Consumption \n(WLTC-cold  -7o C)",{"$f":"Efficiency!F11","v":10},{"$f":"Greenhouse!B13","v":"WLTC-CAT"},{"$f":"Greenhouse!F19","v":7}]
{"$rows_left_out":52}
{"sheet":"Clean Air","index":1,"n_rows":113,"n_cols":31,"rows_kept":113,"cut":false,"hidden":false,"merged":[[1,10,2,10],[1,8,3,8],[13,1,13,2],[41,1,41,2],[1,6,2,7],[1,4,2,5],[1,1,2,2],[3,1,3,2],[31,1,31,2],[22,1,22,2],[50,1,50,2],[79,1,79,2],[97,1,97,2],[109,7,109,8],[70,1,70,2],[104,1,104,2],[87,1,87,3]]}
[null,null,null,null,null,null,null,null,null,null,null,null,null,null,null,null,1]
[null,"1. Pollutants",null,null,"Test Results",null,"Limits",null,"Max score",null,"Fall Back Fuel"]
[]
[null,null,null,null,"Value","Points","lower","upper",null,null,"Value"]
[null,"1.1","Regulatory Tailpipe Emission Lab Tests"]
[null,"WLTC","max points",{"$f":"SUM(I7:I13)","v":10}]
[null,"(14 degr C)","NMHC","mg/km",{"$f":"RESULTS!$O4-RESULTS!$P4","v":0},{"$f":"IF(OR(Hydrogen,Electric),I7,IF(E7=0,Sliding_Scale(E7,G7,H7,I7,0,Slide_Type),IF(K7/E7>='LIMITS Efficiency'!$E$25,(1-'LIMITS Efficiency'!$E$26)*Sliding_Scale(E7,G7,H7,I7,0,Slide_Type),Sliding_Scale(E7,G7,H7,I7,0,Slide_Type))))","v":2},{"$f":"'LIMITS Clean Air'!$D$15","v":0},{"$f":"IF(OR(Petrol,CNG_Mono,CNG_Dual),'LIMITS Clean Air'!C$5,IF(Diesel,'LIMITS Clean Air'!D5,0))","v":58},2,null,{"$f":"RESULTS!$O$26","v":0}]
[null,null,"NOx ","mg/km",{"$f":"RESULTS!$H$4","v":0},{"$f":"IF(OR(Hydrogen,Electric),I8,IF(E8=0,Sliding_Scale(E8,G8,H8,I8,0,Slide_Type),IF(K8/E8>='LIMITS Efficiency'!$E$25,(1-'LIMITS Efficiency'!$E$26)*Sliding_Scale(E8,G8,H8,I8,0,Slide_Type),Sliding_Scale(E8,G8,H8,I8,0,Slide_Type))))","v":3},{"$f":"'LIMITS Clean Air'!$D$16","v":0},{"$f":"IF(OR(Petrol,CNG_Mono,CNG_Dual),'LIMITS Clean Air'!C$6,IF(Diesel,'LIMITS Clean Air'!D$6,0))","v":60},3,null,{"$f":"RESULTS!$H$26","v":0}]
[null,null,"NO2","mg/km",{"$f":"RESULTS!$J$4","v":0},{"$f":"IF(OR(Hydrogen,Electric),I9,IF(E9=0,Sliding_Scale(E9,G9,H9,I9,0,Slide_Type),IF(K9/E9>='LIMITS Efficiency'!$E$25,(1-'LIMITS Efficiency'!$E$26)*Sliding_Scale(E9,G9,H9,I9,0,Slide_Type),Sliding_Scale(E9,G9,H9,I9,0,Slide_Type))))","v":0},{"$f":"'LIMITS Clean Air'!$D$17","v":0},{"$f":"IF(OR(Petrol,CNG_Mono,CNG_Dual),'LIMITS Clean Air'!C$7,IF(Diesel,'LIMITS Clean Air'!D$7,0))","v":20},0,null,{"$f":"RESULTS!$M$26","v":0}]
[null,null,"NH3","mg/km",{"$f":"RESULTS!$N$4","v":0},{"$f":"IF(OR(Hydrogen,Electric),I10,IF(E10=0,Sliding_Scale(E10,G10,H10,I10,0,Slide_Type),IF(K10/E10>='LIMITS Efficiency'!$E$25,(1-'LIMITS Efficiency'!$E$26)*Sliding_Scale(E10,G10,H10,I10,0,Slide_Type),Sliding_Scale(E10,G10,H10,I10,0,Slide_Type))))","v":1},{"$f":"'LIMITS Clean Air'!$D$18","v":0},{"$f":"IF(OR(Petrol,CNG_Mono,CNG_Dual),'LIMITS Clean Air'!C$8,IF(Diesel,'LIMITS Clean Air'!D$8,0))","v":10},1,null,{"$f":"RESULTS!$N$26","v":0}]
{"$rows_left_out":104}
{"sheet":"Efficiency","index":2,"n_rows":53,"n_cols":19,"rows_kept":53,"cut":false,"hidden":false,"merged":[[44,2,44,4],[52,5,52,6],[31,1,31,2],[49,1,49,2],[43,1,43,2],[49,5,49,6],[3,1,3,2],[39,1,39,2],[1,8,3,8],[1,1,2,2],[1,4,2,5],[1,6,2,7],[18,1,18,2],[14,1,17,1],[12,1,13,1]]}
[]
[null,"2. Efficiency",null,null,"Test Results",null,"Limits",null,"Max score"]
[]
[null,null,null,null,"Value","Points","lower","upper"]
[]
[null,"2.1","Test cycle measurements"]
[]
[null,"2.1.2","Energy Consumption (total)",null,null,null,null,null,null,null,"2.1.2.1",null,null,"2.1.2.2",null,null,"2.1.2.3"]
[null,null,"max points",{"$f":"I19","v":40},null,null,null,null,null,null,"Fuel Consumption (ICE liq. fuel)",null,null,"Energy Consumption (Electr. mode)",null,null,"Fuel Consumption (ICE, CNG, Hydrogen fuel cell)"]
[null,"Lab tests","WLTC cold (14 degr C)","kWh/100km",{"$f":"IF(Petrol,Efficiency!M10*'LIMITS Efficiency'!$C$18,IF(Diesel,Efficiency!M10*'LIMITS Efficiency'!$C$19,IF(OR(CNG_Mono,CNG_Dual),S10*'LIMITS Efficiency'!$C$20,IF(Hydrogen,S10*'LIMITS Efficiency'!$C$22,0)))+P10)","v":0},{"$f":"MAX(0,Sliding_Scale(E10,G10,H10,I10,0,Slide_Type))","v":10},{"$f":"'LIMITS Efficiency'!E6","v":30},{"$f":"'LIMITS Efficiency'!F6","v":90},10,null,"WLTC cold (14 degr C)","l/100km",{"$f":"IF(OR(Petrol,Diesel),MAX(RESULTS!$Q$4,RESULTS!$Q$26),0)","v":0},"WLTC cold (14 degr C)","kWh/100km",{"$f":"IF(Electric,MAX(RESULTS!R4,RESULTS!R26),0)","v":0},"WLTC cold (14 degr C)","kg/100km",{"$f":"IF(OR(CNG_Mono,CNG_Dual,Hydrogen),MAX(RESULTS!U4,RESULTS!U26),0)","v":0}]
{"$rows_left_out":44}
{"sheet":"Greenhouse","index":3,"n_rows":86,"n_cols":26,"rows_kept":86,"cut":false,"hidden":false,"merged":[[4,17,4,25],[77,1,77,2],[81,1,81,2],[81,6,81,7],[16,17,16,25],[6,17,6,18],[6,23,6,24],[70,1,70,2],[6,20,6,21],[85,1,85,2],[85,3,85,4],[85,6,85,7],[1,10,2,10],[3,1,3,2],[56,1,56,2],[1,1,2,2],[1,4,2,5],[1,6,2,7],[1,8,3,8],[11,1,11,2],[25,1,25,2],[33,1,33,2],[18,1,18,2],[40,1,40,2],[63,1,63,2]]}
[null,null,null,null,null,null,null,null,null,null,null,null,null,null,null,null,1]
[null,"3.Greenhouse gasses",null,null,"Test Results",null,"Limits",null,"Max score",null,"Fall Back Fuel"]
[]
[null,null,null,null,"Value","Points","lower","upper",null,null,"Value"]
[null,"3.1","Regulatory Tailpipe Emission Lab Tests",null,null,null,null,null,null,null,null,null,null,null,null,null,null,"CO2 equivalent upstream"]
[null,"WLTC","max points",{"$f":"SUM(I7:I9)","v":7},null,null,null,null,null,null,null,null,null,null,null,null,null,"ICE Liquid Fuel",null,"Factor","Electricity",null,"Factor","ICE Gaseous Fuel",null,"Factor"]
[null,"(14 degr C)","N2O","mg/km",{"$f":"RESULTS!M4","v":0},{"$f":"IF(OR(Hydrogen,Electric),I7,IF(E7=0,Sliding_Scale(E7,G7,H7,I7,0,Slide_Type),IF(K7/E7>='LIMITS Efficiency'!$E$25,(1-'LIMITS Efficiency'!$E$26)*Sliding_Scale(E7,G7,H7,I7,0,Slide_Type),Sliding_Scale(E7,G7,H7,I7,0,Slide_Type))))","v":1},{"$f":"'LIMITS Greenhouse'!$E$16","v":0},{"$f":"IF(OR(Petrol,CNG_Mono,CNG_Dual),'LIMITS Greenhouse'!$D$6,IF(Diesel,'LIMITS Greenhouse'!$E$6,0))","v":6.2},1,null,{"$f":"RESULTS!$M$26","v":0},null,null,null,null,null,null,{"$f":"IF(Petrol,\"Petrol\",IF(Diesel,\"Diesel\",\"-\"))","v":"Petrol"},null,{"$f":"IF(Petrol,'LIMITS Greenhouse'!$D$28,IF(Diesel,'LIMITS Greenhouse'!$D$29,0))","v":0.188},{"$f":"IF(Electric,\"Electric\",\"-\")","v":"-"},null,{"$f":"'LIMITS Greenhouse'!D30","v":217.5},{"$f":"IF(CNG_Mono,\"CNG Monovalent\",IF(CNG_Dual,\"CNG Dual Fuel\",\"-\"))","v":"-"},null,{"$f":"IF(OR(Petrol,CNG_Mono,CNG_Dual),'LIMITS Greenhouse'!$D$31,IF(Diesel,'LIMITS Greenhouse'!$E$32,0))","v":0.23100000000000001}]
[null,null,"CH4","mg/km",{"$f":"RESULTS!P4","v":0},{"$f":"IF(OR(Hydrogen,Electric),I8,IF(E8=0,Sliding_Scale(E8,G8,H8,I8,0,Slide_Type),IF(K8/E8>='LIMITS Efficiency'!$E$25,(1-'LIMITS Efficiency'!$E$26)*Sliding_Scale(E8,G8,H8,I8,0,Slide_Type),Sliding_Scale(E8,G8,H8,I8,0,Slide_Type))))","v":2},{"$f":"'LIMITS Greenhouse'!$E$17","v":0},{"$f":"IF(OR(Petrol,CNG_Mono,CNG_Dual),'LIMITS Greenhouse'!$D$7,IF(Diesel,'LIMITS Greenhouse'!$E$7,0))","v":32},2,null,{"$f":"RESULTS!$P$26","v":0},null,null,null,null,null,null,"WLTC cold (14 degr C)","g/km",{"$f":"(IF(OR(Petrol,Diesel),MAX(RESULTS!$E4,RESULTS!$E26,0),0)*T$7)","v":0},"WLTC cold (14 degr C)","g/km",{"$f":"(IF(Electric,MAX(RESULTS!R4,RESULTS!R26),0)/100)*$W$7","v":0},"WLTC cold (14 degr C)","g/km",{"$f":"(IF(OR(CNG_Mono,CNG_Dual),MAX(RESULTS!E4,RESULTS!E26),0)*$Z$7)","v":0}]
[null,null,"Total CO2","g/km",{"$f":"E10+E11","v":0},{"$f":"IF(OR(Hydrogen,Electric),I9,IF(E9=0,Sliding_Scale(E9,G9,H9,I9,0,Slide_Type),IF(K9/E9>='LIMITS Efficiency'!$E$25,(1-'LIMITS Efficiency'!$E$26)*Sliding_Scale(E9,G9,H9,I9,0,Slide_Type),Sliding_Scale(E9,G9,H9,I9,0,Slide_Type))))","v":4},{"$f":"'LIMITS Greenhouse'!$E$18","v":0},{"$f":"IF(OR(Petrol,CNG_Mono,CNG_Dual),'LIMITS Greenhouse'!$D$8,IF(Diesel,'LIMITS Greenhouse'!$E$8,0))","v":175},4,null,0,null,null,null,null,null,null,"WLTC cold (-7 degr C)","g/km",{"$f":"(IF(OR(Petrol,Diesel),MAX(RESULTS!$E7,RESULTS!$E29,0))*T$7)","v":0},"WLTC cold (-7 degr C)","g/km",{"$f":"(IF(Electric,MAX(RESULTS!R7,RESULTS!R29),0)/100)*$W$7","v":0},"WLTC cold (-7 degr C)","g/km",{"$f":"(IF(OR(CNG_Mono,CNG_Dual),MAX(RESULTS!E7,RESULTS!E29),0)*$Z$7)","v":0}]
[null,null,"CO2 tailpipe","g/km",{"$f":"(IF(OR(Petrol,Diesel,CNG_Mono,CNG_Dual),MAX(RESULTS!F4,RESULTS!F26,0),0))","v":0},null,null,null,null,null,null,null,null,null,null,null,null,"WLTC-warm","g/km",{"$f":"(IF(OR(Petrol,Diesel),MAX(RESULTS!$E8,RESULTS!$E30,0))*T$7)","v":0},"WLTC-warm","g/km",{"$f":"(IF(Electric,MAX(RESULTS!R8,RESULTS!R30),0)/100)*$W$7","v":0},"WLTC-warm","g/km",{"$f":"(IF(OR(CNG_Mono,CNG_Dual),MAX(RESULTS!E8,RESULTS!E30),0)*$Z$7)","v":0}]
{"$rows_left_out":77}
{"sheet":"RESULTS","index":4,"n_rows":44,"n_cols":26,"rows_kept":44,"cut":false,"hidden":false,"merged":[[36,2,40,2],[32,2,33,2],[10,2,11,2],[23,1,23,3],[14,2,18,2],[19,1,21,1],[19,2,19,3],[20,2,20,3],[21,2,21,3],[42,1,43,1],[42,2,42,3],[43,2,43,3],[23,0,43,0],[1,0,21,0],[32,1,40,1],[25,1,31,1],[10,1,18,1],[3,1,9,1],[34,2,35,2],[12,2,13,2],[25,2,28,2],[29,2,31,2],[3,2,6,2],[7,2,9,2],[1,1,1,3]]}
[]
["DOMINANT FUEL","MAIN RESULTS 1",null,null,"CO2\ntailpipe","CO2                RCB corr.","CO","NOx","NO","NO2","PN","PM","N2O","NH3","THC","CH4","Fuel Consumption","Energy Consumption","Fuel consumpt.","Energy consumpt.","Gas Consumption","Board Comp.\n fuel consumpt.","Board Comp.\n energy consumpt.","Board Comp.\ngas consumpt.","Driving Range\n(ICE mode)","Driving Range\n(electr. mode)"]
[null,null,null,null,"g/km","g/km","mg/km","mg/km","mg/km","mg/km","#/km","mg/km","mg/km","mg/km","mg/km","mg/km","l/100km","kWh/100km","g/s","Wh/s","kg/100km","L/100km","kWh/100km","kg/100km","km","km"]
[null,"Laboratory Tests","WLTC+ appr.","WLTC+ cold engine (14 degr C)",null,null,null,null,null,null,null,null,null,null,null,null,null,null,"n.a.","n.a."]
[null,null,null,"WLTC+ cold engine 2 (not rated)",null,null,null,null,null,null,null,null,null,null,null,null,null,null,"n.a.","n.a."]
[null,null,null,"WLTC+ cold engine average (not rated)",null,null,null,null,null,null,null,null,null,null,null,null,null,null,"n.a.","n.a."]
[null,null,null,"WLTC+ cold engine (-7 degr C)",null,null,null,null,null,null,null,null,null,null,null,null,null,null,"n.a.","n.a."]
[null,null,"Robustness","WLTC+ warm engine",null,null,null,null,null,null,null,null,null,null,null,null,null,null,"n.a.","n.a."]
[null,null,null,"WLTC+ reg. warm engn. rep. (not rated)",null,null,null,null,null,null,null,null,null,null,null,null,null,null,"n.a.","n.a."]
[null,null,null,"BAB130 Motorway",null,null,null,null,null,null,null,null,null,null,null,null,null,null,"n.a.","n.a."]
{"$rows_left_out":35}
{"sheet":"SPECS","index":5,"n_rows":26,"n_cols":16,"rows_kept":26,"cut":false,"hidden":false,"merged":[]}
["Brand",null,"e.g. Mercedes-Benz",null,null,null,null,null,null,null,null,"Petrol (inc hybrids)",{"$f":"IF(ICE_Type=1,TRUE,FALSE)","v":true},1,"Version","Euro 6b"]
["Model:",null,"e.g. V-Class",null,null,null,null,null,null,null,null,"Diesel (inc. hybrids)",{"$f":"IF(ICE_Type=2,TRUE,FALSE)","v":false},true,"2020.2.0.1","Euro 6c"]
["Variant Name:",null,"e.g. V250d 9gtronic",null,null,null,null,null,null,null,null,"Petrol PHEV",{"$f":"IF(ICE_Type=3,TRUE,FALSE)","v":false},null,null,"Euro 6d-Temp"]
["Test Reference Number:",null,"e.g. 20-FOR-0023",null,null,null,null,null,null,null,null,"Diesel PHEV",{"$f":"IF(ICE_Type=4,TRUE,FALSE)","v":false},null,null,"Euro 6d"]
["Drivetrain:",null,"e.g. 4x2",null,null,null,null,null,null,null,null,"ICE - CNG - Mono",{"$f":"IF(ICE_Type=5,TRUE,FALSE)","v":false}]
["Drive axle (FWD/AWD/RWD):",null,"e.g. RWD",null,null,null,null,null,null,null,null,"ICE - CNG - Dual",{"$f":"IF(ICE_Type=6,TRUE,FALSE)","v":false}]
["Fuel Type:",null,"e.g. diesel",null,null,null,null,null,null,null,null,"Hydrogen",{"$f":"IF(ICE_Type=7,TRUE,FALSE)","v":false}]
["Primary fuel source (if applicable):",null,"e.g. diesel",null,null,null,null,null,null,null,null,"Battery Electric",{"$f":"IF(ICE_Type=8,TRUE,FALSE)","v":false}]
["Secondary fuel source (if applicable):",null,"e.g. electric",null,null,null,null,null,null,null,null,null,{"$f":"COUNTIF(EngineType,\"False\")","v":4}]
["Fuel tank size liquid fuel (l)",null,"e.g. 70"]
{"$rows_left_out":17}
{"sheet":"LIMITS Clean Air","index":6,"n_rows":25,"n_cols":19,"rows_kept":25,"cut":false,"hidden":false,"merged":[[0,1,0,14],[12,12,12,14],[13,12,13,14],[14,12,14,13],[15,12,15,13],[14,7,14,8],[15,7,15,8],[2,1,2,3],[12,1,12,3],[13,1,13,3],[12,7,12,9],[13,7,13,9],[14,1,14,2],[15,1,15,2],[2,6,2,8],[2,11,2,13],[2,16,2,18],[21,12,21,14],[20,1,20,2],[16,1,16,2],[17,1,17,2],[17,12,17,13],[18,12,18,13],[16,12,16,13],[18,1,18,2],[19,1,19,2],[19,7,19,8],[20,7,20,8],[18,7,18,8],[16,7,16,8],[17,7,17,8],[22,12,22,14],[23,12,23,14],[24,12,24,14],[19,12,19,13],[20,12,20,13]]}
[null,"Clean Air (Pollutants)"]
[]
[null,"u p p e r   l i m i t s (labtests)",null,null,"gross excess",null,"u p p e r   l i m i t s (PEMS tests)",null,null,"gross excess",null,"u p p e r   l i m i t s (extended bouderies)",null,null,"gross excess",null,"PEMS Congestion"]
[null,null,"petrol","diesel",{"$f":"IF(Petrol,\"petrol\",IF(Diesel,\"diesel\",\"n.a\"))","v":"petrol"},null,null,"petrol","diesel",{"$f":"IF(Petrol,\"petrol\",IF(Diesel,\"diesel\",\"n.a\"))","v":"petrol"},null,null,"petrol","diesel",{"$f":"IF(Petrol,\"petrol\",IF(Diesel,\"diesel\",\"n.a\"))","v":"petrol"},null,null,"max ","avg"]
[null,"HC",58,{"$f":"90-32","v":58},{"$f":"IF(OR(Petrol,CNG_Mono,CNG_Dual),1.2*C5,IF(Diesel,1.5*D5,\"n.a.\"))","v":69.599999999999994},null,"HC",{"$f":"C5*$J$12","v":76.56},76.56,{"$f":"IF(OR(Petrol,CNG_Dual,CNG_Mono),1.5*H5,IF(Diesel,1.5*I5,\"n.a.\"))","v":114.84},null,"HC",{"$f":"C5*$O$12","v":76.56},76.56,{"$f":"IF(OR(Petrol,CNG_Mono,CNG_Dual),1.5*M5,IF(Diesel,1.5*N5,\"n.a.\"))","v":114.84},null,null,"mg/s","mg/s"]
[null,"NOx",60,60,72,null,"NOx",79.2,79.2,118.80000000000001,null,"NOx",79.2,79.2,118.80000000000001,null,"NOx",1,0.5]
[null,"NO2",20,20,24,null,"NO2",26.400000000000002,26.400000000000002,39.6,null,"NO2",26.400000000000002,26.400000000000002,39.6]
[null,"NH3",10,10,12,null,"NH3",13.200000000000001,13.200000000000001,19.8,null,"NH3",13.200000000000001,13.200000000000001,19.8]
[null,"CO",500,500,600,null,"CO",660,660,990,null,"CO",660,660,990]
[null,"PM",4.5,4.5,5.3999999999999995,null,"PM",5.94,5.94,8.91,null,"PM",5.94,5.94,8.91]
{"$rows_left_out":16}
{"sheet":"LIMITS Efficiency","index":7,"n_rows":34,"n_cols":7,"rows_kept":34,"cut":false,"hidden":false,"merged":[[1,1,1,7],[23,1,23,4],[29,1,29,3],[28,1,28,3],[25,1,25,3],[24,1,24,3],[5,1,9,1],[11,1,12,1],[15,1,15,7],[3,1,3,5]]}
[]
[null,"Efficiency"]
[]
[null,"Energy Consumption (total)"]
[null,"limits:",null,null,"lower","upper","mid"]
[null,"Lab tests","WLTC cold (14 degr C)","kWh/100km",30,90,30]
[null,null,"WLTC cold (-7 degr C)","kWh/100km",{"$f":"E6","v":30},{"$f":"F6","v":90},{"$f":"G6","v":30}]
[null,null,"WLTC-warm","kWh/100km",{"$f":"E7","v":30},{"$f":"F7","v":90},{"$f":"G7","v":30}]
[null,null,"WLTC -eco","kWh/100km",30,90,30]
[null,null,"WLTC-sport","kWh/100km",30,90,30]
{"$rows_left_out":25}
{"sheet":"LIMITS Greenhouse","index":8,"n_rows":32,"n_cols":16,"rows_kept":32,"cut":false,"hidden":false,"merged":[[1,1,1,15],[20,8,20,9],[21,8,21,9],[14,8,14,10],[15,8,15,9],[16,8,16,9],[20,2,20,3],[20,13,20,14],[21,2,21,3],[21,13,21,14],[14,13,14,15],[14,2,14,4],[15,2,15,3],[15,13,15,14],[17,8,17,9],[19,8,19,9],[16,2,16,3],[16,13,16,14],[17,2,17,3],[18,2,18,3],[19,2,19,3],[19,13,19,14],[17,13,17,14],[32,1,32,2],[33,1,33,2],[25,1,25,3],[27,1,27,2],[28,1,28,2],[29,1,29,2],[31,1,31,2]]}
[]
[null,"Greenhouse gases"]
[]
[null,"GWP","u p p e r   l i m i t s (labtests)",null,null,"gross excess",null,"u p p e r   l i m i t s (PEMS tests)",null,null,"gross excess",null,"u p p e r   l i m i t s (WLTC  CAT test, -7 C)",null,null,"gross excess"]
[null,null,null,"petrol","diesel",{"$f":"IF(Petrol,\"petrol\",IF(Diesel,\"diesel\",\"n.a\"))","v":"petrol"},null,null,"petrol","diesel",{"$f":"IF(Petrol,\"petrol\",IF(Diesel,\"diesel\",\"n.a\"))","v":"petrol"},null,null,"petrol","diesel",{"$f":"IF(Petrol,\"petrol\",IF(Diesel,\"diesel\",\"n.a\"))","v":"petrol"}]
[null,298,"N2O",6.2,6.2,{"$f":"IF(OR(Petrol,CNG_Mono,CNG_Dual),1.5*D6,IF(Diesel,1.5*E6,\"n.a.\"))","v":9.3000000000000007},null,"NO2",{"$f":"D6*$K$13","v":9.3000000000000007},9.3000000000000007,{"$f":"IF(Petrol,1.5*I6,IF(Diesel,1.5*J6,\"n.a.\"))","v":13.950000000000001},null,"NO2",{"$f":"D6*$P$13","v":9.9200000000000017},{"$f":"E6*$P$13","v":9.9200000000000017},{"$f":"IF(Petrol,1.5*N6,IF(Diesel,1.5*O6,\"n.a.\"))","v":14.880000000000003}]
[null,25,"CH4",32,32,{"$f":"IF(OR(Petrol,CNG_Mono,CNG_Dual),1.5*D7,IF(Diesel,1.5*E7,\"n.a.\"))","v":48},null,"CH4",48,48,{"$f":"IF(Petrol,1.5*I7,IF(Diesel,1.5*J7,\"n.a.\"))","v":72},null,"CH4",{"$f":"D7*$P$13","v":51.2},{"$f":"E7*$P$13","v":51.2},{"$f":"IF(Petrol,1.5*N7,IF(Diesel,1.5*O7,\"n.a.\"))","v":76.800000000000011}]
[null,1,"CO2",175,175,{"$f":"IF(OR(Petrol,CNG_Mono,CNG_Dual),1.5*D8,IF(Diesel,1.5*E8,\"n.a.\"))","v":262.5},null,"CO2",262.5,262.5,{"$f":"IF(Petrol,1.5*I8,IF(Diesel,1.5*J8,\"n.a.\"))","v":393.75},null,"CO2",{"$f":"D8","v":175},{"$f":"E8","v":175},{"$f":"IF(Petrol,1.5*N8,IF(Diesel,1.5*O8,\"n.a.\"))","v":262.5}]
[]
[]
{"$rows_left_out":23}
{"sheet":"WEBSITE SUMMARY","index":9,"n_rows":159,"n_cols":4,"rows_kept":159,"cut":false,"hidden":true,"merged":[]}
["Car Model",{"$f":"CONCATENATE(SPECS!B1,\" \",SPECS!B2)","v":" "},"Comment SV","Type"]
["Type",{"$f":"CONCATENATE(SPECS!B3,\" \",SPECS!B5,\" \",SPECS!B7,\" \",SPECS!B15)","v":"   "}]
["Release Date","2020-11-26"]
["Year of Test",2020]
["Engine",{"$f":"SPECS!B21","v":0}]
["Gearbox",{"$f":"SPECS!B15","v":0}]
["Emissions Class",{"$f":"SPECS!B19","v":0}]
["Stars",{"$f":"Stars","v":5}]
["Test #",{"$f":"SPECS!B4","v":0}]
["Engine Size 2",{"$f":"SPECS!B22","v":0}]
{"$rows_left_out":149}