{"text_format":"1","workbook":"xlsx","n_sheets":11,"sheets":["OVERALL RATING (avg)","SPECS","RESULTS","Clean Air","Efficiency","Greenhouse","LIMITS Clean Air","LIMITS Efficiency","LIMITS Greenhouse","WEBSITE SUMMARY","Track Changes"],"not_rendered":{"charts":1,"images":23,"macros":1,"external_links":0,"defined_names":17,"comments":0,"pivot_tables":0},"unopened":[],"bounds":{"document_bytes":16777216,"sheet_cells":100000,"rows_first":2000,"rows_last":500,"rows_between":2000,"halvings":0,"cell_chars":16384,"cell_head_chars":4096},"cells_cut":0,"cells_raw":0,"read":"whole","date_system":"1900"}

{"sheet":"OVERALL RATING (avg)","index":0,"n_rows":72,"n_cols":12,"rows_kept":72,"cut":false,"hidden":false,"merged":[[64,2,64,4],[64,5,64,7],[65,5,65,6],[66,5,66,6],[67,5,67,6],[63,5,63,6],[58,5,58,6],[59,5,59,6],[60,2,60,4],[60,5,60,7],[61,5,61,6],[62,5,62,6],[57,5,57,6],[57,12,57,15],[50,2,50,7],[51,3,51,4],[51,5,51,7],[52,6,52,7],[53,3,53,4],[53,5,53,7],[55,3,55,4],[55,5,55,7],[56,2,56,4],[56,5,56,7],[56,12,56,15],[45,2,45,3],[45,4,45,5],[45,6,45,7],[46,2,46,3],[46,4,46,5],[46,6,46,7],[43,2,43,3],[43,4,43,5],[43,6,43,7],[44,2,44,3],[44,4,44,5],[44,6,44,7],[24,2,24,3],[24,4,24,5],[24,6,24,7],[25,2,25,7],[42,2,42,3],[42,4,42,5],[42,6,42,7],[22,2,22,3],[22,4,22,5],[22,6,22,7],[23,2,23,3],[23,4,23,5],[23,6,23,7],[8,1,12,1],[10,18,10,23],[14,1,17,1],[21,2,21,3],[21,4,21,5],[21,6,21,7],[7,2,7,3],[7,4,7,5],[7,6,7,7],[2,1,3,1],[2,2,3,2],[6,2,6,3],[6,4,6,5],[6,6,6,7],[68,2,68,4],[68,5,68,7],[69,5,69,6],[70,5,70,6],[71,5,71,6]]}
[]
[]
[null,{"$f":"CONCATENATE(D52,\" \",F52)","v":"0 0"}]
[]
[]
[]
[null,null,"Clean Air Index\n",null,"Energy Efficiency Index\n",null,"Greenhouse Gas Index\n"]
[null,null,32.6,null,40.5]
[null,"Standard Testing",{"$f":"'Clean Air'!B6","v":"WLTC+ warm engine"},{"$f":"'Clean Air'!F14","v":{"$error":"#NAME?"}},{"$f":"Efficiency!C12","v":"WLTC+ warm engine"},{"$f":"SUM(Efficiency!F12:F14)","v":{"$error":"#NAME?"}},{"$f":"Greenhouse!B24","v":"WLTC+ warm engine"},{"$f":"Greenhouse!F32","v":{"$error":"#NAME?"}}]
[null,null,{"$f":"'Clean Air'!B15","v":"WLTC+ cold engine (23°C)"},{"$f":"'Clean Air'!F23","v":{"$error":"#NAME?"}},{"$f":"Efficiency!C10","v":"WLTC+ cold engine (23°C)"},{"$f":"Efficiency!F10","v":{"$error":"#NAME?"}},{"$f":"Greenhouse!B6","v":"WLTC+ cold engine (23°C)"},{"$f":"Greenhouse!F14","v":{"$error":"#NAME?"}}]
{"$rows_left_out":63}
{"sheet":"SPECS","index":1,"n_rows":47,"n_cols":21,"rows_kept":47,"cut":false,"hidden":false,"merged":[]}
["Brand",null,"CoC p.0.1. (e.g. Mercedes-Benz)",null,null,null,null,null,null,null,null,"Petrol (inc hybrids)",{"$f":"IF(ICE_Type=1,TRUE,FALSE)","v":true},1,"Rating Sheet Version","Euro 6b",1]
["Model",null,"CoC p.0.2.1. (e.g. V-Class)",null,null,null,null,null,null,null,null,"Diesel (inc. hybrids)",{"$f":"IF(ICE_Type=2,TRUE,FALSE)","v":false},true,"2023.2.0.8.7","Euro 6c"]
["Variant Name",null,"Model data (e.g. V250d, 9G-Tronic, Avantgarde)",null,null,null,null,null,null,null,null,"ICE - CNG - Mono",{"$f":"IF(ICE_Type=3,TRUE,FALSE)","v":false},null,"Protocols","Euro 6d-Temp"]
["Green NCAP Test Reference Number",null,"(e.g. 20-FOR-0023)",null,null,null,null,"SELECT",null,null,null,"ICE - CNG - Dual",{"$f":"IF(ICE_Type=4,TRUE,FALSE)","v":false},null,2022,"Euro 6d"]
["Drivetrain",null,"CoC p.3. (e.g. RWD)",null,null,null,null,null,null,null,null,"Hydrogen",{"$f":"IF(ICE_Type=6,TRUE,FALSE)","v":false},null,null,"Euro AX"]
["Fuel Type",{"$f":"IF(Petrol,\"Petrol\",IF(Diesel,\"Diesel\",IF(E_85,\"Ethanol E85\",IF(CNG_Dual,\"CNG\",IF(CNG_Mono,\"CNG\",IF(Hydrogen,\"Hydrogen\",IF(Electric,\"Electric\")))))))","v":"Petrol"},"CoC p.26. (e.g. diesel, bi-fuel)",null,null,null,null,null,null,"Respect Green NCAP's definition of \"Hybrid\".",null,"Battery Electric",{"$f":"IF(ICE_Type=5,TRUE,FALSE)","v":false}]
["Primary fuel source",{"$f":"IF(Petrol,\"Petrol\",IF(Diesel,\"Diesel\",IF(E_85,\"Ethanol E85\",IF(CNG_Dual,\"CNG\",IF(CNG_Mono,\"CNG\",IF(Hydrogen,\"Hydrogen\",IF(Electric,\"Electric\")))))))","v":"Petrol"},null,null,null,null,null,null,null,null,null,"Ethanol E85",{"$f":"IF(ICE_Type=7,TRUE,FALSE)","v":false},null,null,"Manual"]
["Secondary fuel source (if applicable)",null,null,null,null,null,null,null,null,null,null,null,null,null,null,"Automatic"]
["Fuel tank size liquid fuel [l]",null,"Tech data (e.g. 70 l)",null,null,null,null,null,null,null,null,"Hybrid",false,null,null,"CVT"]
["Fuel tank size gaseous fuel [kg]",null,"Tech data (e.g. 15 kg)"]
{"$rows_left_out":38}
{"sheet":"RESULTS","index":2,"n_rows":44,"n_cols":30,"rows_kept":44,"cut":false,"hidden":false,"merged":[[36,2,40,2],[32,2,33,2],[10,2,11,2],[23,1,23,3],[14,2,18,2],[19,1,21,1],[19,2,19,3],[20,2,20,3],[21,2,21,3],[42,1,43,1],[42,2,42,3],[43,2,43,3],[23,0,43,0],[1,0,21,0],[32,1,40,1],[25,1,31,1],[10,1,18,1],[3,1,9,1],[34,2,35,2],[12,2,13,2],[25,2,28,2],[29,2,31,2],[3,2,6,2],[7,2,9,2],[1,1,1,3]]}
[]
["DOMINANT FUEL","MAIN RESULTS 1",null,null,"CO2\ntailpipe","CO2                RCB corr.","CO","NOx","NO","NO2","PN","PM","N2O","NH3","THC","CH4","Fuel Consumption","Energy Consumption from Grid","Fuel consumpt.","Energy consumpt.","Gas Consumption","Board Comp.\n fuel consumpt.","Board Comp.\n energy consumpt.","Board Comp.\ngas consumpt.","Driving Range\n(ICE mode)","Driving Range\n(electr. mode)","Measured Recharged Electric Energy (BEV and PHEV, from grid) ","Measured Netto Battery Capacity","Efiiciency grid to battery output","Electr. energy consumpt. from battery"]
[null,null,null,null,"g/km","g/km","mg/km","mg/km","mg/km","mg/km","#/km","mg/km","mg/km","mg/km","mg/km","mg/km","l/100km","kWh/100km","g/s","Wh/s","kg/100km","l/100km","kWh/100km","kg/100km","km","km","kWh","kWh","%","kWh/100km"]
[null,"Laboratory Tests","WLTC+ appr.","WLTC+ cold engine (23°C)"]
[null,null,null,"WLTC+ cold engine 2 (not rated)"]
[null,null,null,"WLTC+ cold engine average (not rated)"]
[null,null,null,"WLTC+ CAT (-7°C)"]
[null,null,"Robustness","WLTC+ warm engine"]
[null,null,null,"WLTC+ reg. warm engn. rep. (not rated)"]
[null,null,null,"BAB130 Motorway"]
{"$rows_left_out":35}
{"sheet":"Clean Air","index":3,"n_rows":109,"n_cols":17,"rows_kept":109,"cut":false,"hidden":false,"merged":[[104,7,104,9],[4,1,4,3],[60,1,60,3],[102,0,109,0],[111,0,114,0],[115,0,117,0],[119,0,127,0],[103,1,103,2],[32,0,40,0],[53,0,78,0],[42,0,51,0],[78,1,78,2],[99,1,99,2],[90,0,97,0],[101,1,101,2],[105,1,105,2],[79,11,86,11],[70,11,77,11],[87,1,87,2],[97,1,97,2],[1,10,2,10],[1,8,3,8],[22,1,22,2],[1,6,2,7],[1,4,2,5],[1,1,2,2],[3,1,3,2]]}
[null,null,null,null,null,null,null,null,null,null,null,null,null,null,null,null,1]
[null,"1. Clean Air Index",null,null,"Test Results",null,"Thresholds",null,"Max score",null,"Fall Back Fuel"]
[]
[null,null,null,null,"Value","Points","Lower","Upper",null,null,"Value"]
[null,"Standard"]
[null,{"$f":"RESULTS!D8","v":"WLTC+ warm engine"},"max points",10]
[null,null,"NMHC","mg/km",{"$f":"RESULTS!$O$8-RESULTS!$P$8","v":0},{"$f":"IF(OR(Hydrogen,Electric),I7,IF(E7=0,Sliding_Scale(E7,G7,H7,I7,0,Slide_Type),IF(K7/E7>='LIMITS Efficiency'!$E$27,(1-'LIMITS Efficiency'!$E$28)*Sliding_Scale(E7,G7,H7,I7,0,Slide_Type),Sliding_Scale(E7,G7,H7,I7,0,Slide_Type))))","v":{"$error":"#NAME?"}},{"$f":"'LIMITS Clean Air'!$D$20","v":0.5},{"$f":"'LIMITS Clean Air'!$D$6","v":58},2]
[null,null,"NOx","mg/km",{"$f":"RESULTS!$H$8","v":0},{"$f":"IF(OR(Hydrogen,Electric),I8,IF(E8=0,Sliding_Scale(E8,G8,H8,I8,0,Slide_Type),IF(K8/E8>='LIMITS Efficiency'!$E$27,(1-'LIMITS Efficiency'!$E$28)*Sliding_Scale(E8,G8,H8,I8,0,Slide_Type),Sliding_Scale(E8,G8,H8,I8,0,Slide_Type))))","v":{"$error":"#NAME?"}},{"$f":"'LIMITS Clean Air'!$D$21","v":0.5},{"$f":"'LIMITS Clean Air'!$D$7","v":60},3]
[null,null,"NO2","mg/km",{"$f":"RESULTS!$J$8","v":0},{"$f":"IF(OR(Hydrogen,Electric),I9,IF(E9=0,Sliding_Scale(E9,G9,H9,I9,0,Slide_Type),IF(K9/E9>='LIMITS Efficiency'!$E$27,(1-'LIMITS Efficiency'!$E$28)*Sliding_Scale(E9,G9,H9,I9,0,Slide_Type),Sliding_Scale(E9,G9,H9,I9,0,Slide_Type))))","v":{"$error":"#NAME?"}},{"$f":"'LIMITS Clean Air'!$D$22","v":0},{"$f":"'LIMITS Clean Air'!$D$8","v":20},0]
[null,null,"NH3","mg/km",{"$f":"RESULTS!$N$8","v":0},{"$f":"IF(OR(Hydrogen,Electric),I10,IF(E10=0,Sliding_Scale(E10,G10,H10,I10,0,Slide_Type),IF(K10/E10>='LIMITS Efficiency'!$E$27,(1-'LIMITS Efficiency'!$E$28)*Sliding_Scale(E10,G10,H10,I10,0,Slide_Type),Sliding_Scale(E10,G10,H10,I10,0,Slide_Type))))","v":{"$error":"#NAME?"}},{"$f":"'LIMITS Clean Air'!$D$23","v":0.1},{"$f":"'LIMITS Clean Air'!$D$9","v":10},1]
{"$rows_left_out":100}
{"sheet":"Efficiency","index":4,"n_rows":63,"n_cols":29,"rows_kept":63,"cut":false,"hidden":false,"merged":[[32,5,32,6],[24,1,24,2],[3,1,3,2],[1,8,3,8],[1,4,2,5],[1,6,2,7],[18,1,18,2],[20,6,20,7],[21,6,21,7],[23,6,23,7],[28,1,28,2],[29,1,29,2],[1,1,2,3]]}
[]
[null,"2. Energy Efficiency Index",null,null,"Test Results",null,"Thresholds",null,"Max score"]
[]
[null,null,null,null,"Value","Points","Lower","Upper"]
[]
[null,"2.1","Test cycle measurements"]
[]
[null,"2.1.2","Energy Consumption (total)"]
[null,null,"max points",{"$f":"I19","v":40},"Value","Points","Lower","Upper","Max score"]
[null,"Standard",{"$f":"RESULTS!D4","v":"WLTC+ cold engine (23°C)"},"kWh/100km",{"$f":"IF(Petrol,Efficiency!M23*'LIMITS Efficiency'!$C$19,IF(Diesel,Efficiency!M23*'LIMITS Efficiency'!$C$20,IF(E_85,Efficiency!M23*'LIMITS Efficiency'!$C$24,IF(CNG_Mono,S23*'LIMITS Efficiency'!$C$21,IF(Hydrogen,S23*'LIMITS Efficiency'!$C$23,IF(CNG_Dual,S23*'LIMITS Efficiency'!$C$21+Efficiency!M23*'LIMITS Efficiency'!$C$19,0)))))+P23)","v":0},{"$f":"MAX(0,Sliding_Scale(E10,G10,H10,I10,0,Slide_Type))","v":{"$error":"#NAME?"}},{"$f":"'LIMITS Efficiency'!E6","v":20},{"$f":"'LIMITS Efficiency'!F6","v":90},10]
{"$rows_left_out":54}
{"sheet":"Greenhouse","index":5,"n_rows":97,"n_cols":26,"rows_kept":97,"cut":false,"hidden":false,"merged":[[96,5,96,6],[94,1,94,2],[93,1,93,2],[4,17,4,25],[16,17,16,25],[6,17,6,18],[6,23,6,24],[88,1,88,2],[6,20,6,21],[90,1,90,2],[90,6,91,6],[91,1,91,2],[92,1,92,2],[92,6,93,6],[96,1,96,2],[96,3,96,4],[79,1,79,2],[1,10,2,10],[3,1,3,2],[70,1,70,2],[1,1,2,2],[1,4,2,5],[1,6,2,7],[1,8,3,8],[13,1,13,2],[31,1,31,2],[41,1,41,2],[22,1,22,2],[50,1,50,2]]}
[]
[null,"3.Greenhouse Gas Index",null,null,"Test Results",null,"Thresholds",null,"Max score",null,"Fall Back Fuel"]
[]
[null,null,null,null,"Value","Points","Lower","Upper",null,null,"Value",null,null,null,null,null,null,"Conversion from local consumption kWh/100km to upstream GHG emissions in g/km for different energy carriers"]
[null,"3.1",null,null,null,null,null,null,null,null,null,null,null,null,null,null,null,"CO2 equivalent upstream (Well-to-Tank+)"]
[null,{"$f":"RESULTS!D4","v":"WLTC+ cold engine (23°C)"},"max points",{"$f":"I9","v":10},null,null,null,null,null,null,null,null,null,null,null,null,null,"Liquid Fuel",null,"Factor","Electricity",null,"Factor","Gaseous Fuel",null,"Factor"]
[null,"Standard","N2O tailpipe","mg/km",{"$f":"RESULTS!M4","v":0},{"$f":"IF(E7<=H7,I7,0)","v":0.5},{"$f":"'LIMITS Greenhouse'!$E$14","v":0},{"$f":"IF(OR(Petrol,CNG_Mono,CNG_Dual,E_85),'LIMITS Greenhouse'!$D$6,IF(Diesel,'LIMITS Greenhouse'!$E$6,0))","v":10},0.5,null,{"$f":"RESULTS!$M$26","v":0},null,null,null,null,null,null,{"$f":"IF(Petrol,\"Petrol\",IF(Diesel,\"Diesel\",\"-\"))","v":"Petrol"},null,{"$f":"IF(OR(Petrol,CNG_Dual),'LIMITS Greenhouse'!$D$21,IF(Diesel,'LIMITS Greenhouse'!$D$22,IF(E_85,'LIMITS Greenhouse'!$D$26,0)))","v":0.85607812995876598},{"$f":"IF(Electric,\"Electricity\",\"-\")","v":"-"},null,{"$f":"IF(Electric,'LIMITS Greenhouse'!D23,0)","v":0},{"$f":"IF(CNG_Mono,\"CNG\",IF(CNG_Dual,\"CNG\",IF(Hydrogen,\"Hydrogen\",\"-\")))","v":"-"},null,{"$f":"IF(OR(CNG_Mono,CNG_Dual),'LIMITS Greenhouse'!$D$24,IF(Hydrogen,'LIMITS Greenhouse'!$D$25,0))","v":0}]
[null,null,"CH4 tailpipe","mg/km",{"$f":"RESULTS!P4","v":0},{"$f":"IF(E8<=H8,I8,0)","v":0.5},{"$f":"'LIMITS Greenhouse'!$E$15","v":0},{"$f":"IF(OR(Petrol,CNG_Mono,CNG_Dual,E_85),'LIMITS Greenhouse'!$D$7,IF(Diesel,'LIMITS Greenhouse'!$E$7,0))","v":32},0.5,null,{"$f":"RESULTS!$P$26","v":0},null,null,null,null,null,null,{"$f":"RESULTS!D4","v":"WLTC+ cold engine (23°C)"},"g/km",{"$f":"Efficiency!W23*T$7","v":0},{"$f":"RESULTS!D4","v":"WLTC+ cold engine (23°C)"},"g/km",{"$f":"Efficiency!Z23*$W$7","v":0},{"$f":"RESULTS!D4","v":"WLTC+ cold engine (23°C)"},"g/km",{"$f":"Efficiency!AC23*Greenhouse!$Z$7","v":0}]
[null,null,"Total CO2 equivalent","g/km",{"$f":"SUM(E10:E13)","v":0},{"$f":"Sliding_Scale(E9,G9,H9,I9,0,Slide_Type)","v":{"$error":"#NAME?"}},{"$f":"'LIMITS Greenhouse'!$E$16","v":50},{"$f":"'LIMITS Greenhouse'!D8","v":225},10,null,0,null,null,null,null,null,null,{"$f":"RESULTS!D7","v":"WLTC+ CAT (-7°C)"},"g/km",{"$f":"Efficiency!W24*T$7","v":0},{"$f":"RESULTS!D7","v":"WLTC+ CAT (-7°C)"},"g/km",{"$f":"Efficiency!Z24*$W$7","v":0},{"$f":"RESULTS!D7","v":"WLTC+ CAT (-7°C)"},"g/km",{"$f":"Efficiency!AC24*Greenhouse!$Z$7","v":0}]
[null,null,"CO2 tailpipe","g/km",{"$f":"(IF(OR(Petrol,Diesel,CNG_Mono,CNG_Dual,E_85),MAX(RESULTS!F4,RESULTS!F26,0),0))","v":0},null,null,null,null,null,null,null,null,null,null,null,null,{"$f":"RESULTS!D8","v":"WLTC+ warm engine"},"g/km",{"$f":"Efficiency!W25*T$7","v":0},{"$f":"RESULTS!D8","v":"WLTC+ warm engine"},"g/km",{"$f":"Efficiency!Z25*$W$7","v":0},{"$f":"RESULTS!D8","v":"WLTC+ warm engine"},"g/km",{"$f":"Efficiency!AC25*Greenhouse!$Z$7","v":0}]
{"$rows_left_out":88}
{"sheet":"LIMITS Clean Air","index":6,"n_rows":102,"n_cols":17,"rows_kept":102,"cut":false,"hidden":false,"merged":[[1,1,1,12],[17,14,18,15],[3,6,3,7],[17,2,18,3],[3,2,3,3],[17,6,18,7],[8,14,8,16],[3,10,3,11],[17,10,18,11],[14,10,14,11],[15,10,15,11],[3,14,3,16]]}
[]
[null,"Clean Air (Pollutants)"]
[]
[null,null,"Upper Thresholds (labtests \nw/o WLTC+ CAT (-7°C))",null,"gross excess",null,"Upper Thresholds\n(PEMS+ tests)",null,"gross excess",null,"Upper Thresholds\n WLTC+ CAT (-7°C)\n (extended bouderies)",null,"gross excess",null,"Congestion Simulation\nUpper Thresholds"]
[null,null,null,null,null,null,null,null,null,null,null,null,null,null,null,"Max","Average"]
[null,null,"NMHC",{"$f":"90-32","v":58},{"$f":"1.5*D6","v":87},null,"NMHC",{"$f":"D6*$I$14","v":76.56},{"$f":"1.5*H6","v":114.84},null,"NMHC",{"$f":"D6*$M$14","v":76.56},{"$f":"1.5*L6","v":114.84},null,null,"mg/s","mg/s"]
[null,null,"NOx",60,{"$f":"1.5*D7","v":90},null,"NOx",79.2,{"$f":"1.5*H7","v":118.80000000000001},null,"NOx",79.2,{"$f":"1.5*L7","v":118.80000000000001},null,"NOx",1,0.5]
[null,null,"NO2",20,{"$f":"1.5*D8","v":30},null,"NO2",26.400000000000002,39.6,null,"NO2",26.400000000000002,39.6]
[null,null,"NH3",10,15,null,"NH3",13.200000000000001,19.8,null,"NH3",13.200000000000001,19.8,null,"Eligible for Stage 2 "]
[null,null,"CO",500,750,null,"CO",660,990,null,"CO",660,990,null,"score",{"$f":"'Clean Air'!E102","v":{"$error":"#NAME?"}},{"$f":"IF(P10/P11>=1,\"YES\",\"NO\")","v":{"$error":"#NAME?"}}]
{"$rows_left_out":93}
{"sheet":"LIMITS Efficiency","index":7,"n_rows":38,"n_cols":6,"rows_kept":38,"cut":false,"hidden":false,"merged":[[3,1,3,5],[15,1,15,5],[16,1,16,5],[1,1,1,5],[34,2,34,4],[30,2,30,4],[25,1,25,4],[27,1,27,3],[26,1,26,3]]}
[]
[null,"Energy Efficiency"]
[]
[null,"Energy Consumption Thresholds"]
[null,"Thresholds:",null,null,"Lower","Upper"]
[null,null,{"$f":"RESULTS!D4","v":"WLTC+ cold engine (23°C)"},"kWh/100km",20,90]
[null,null,{"$f":"RESULTS!D7","v":"WLTC+ CAT (-7°C)"},"kWh/100km",20,90]
[null,null,{"$f":"RESULTS!D8","v":"WLTC+ warm engine"},"kWh/100km",20,90]
[null,null,{"$f":"RESULTS!D10","v":"BAB130 Motorway"},"kWh/100km",20,90]
[null,null,{"$f":"RESULTS!D11","v":"PEMS+ cold engine 1"},"kWh/100km",20,90]
{"$rows_left_out":29}
{"sheet":"LIMITS Greenhouse","index":8,"n_rows":33,"n_cols":16,"rows_kept":33,"cut":false,"hidden":false,"merged":[[1,1,1,15],[16,8,16,9],[12,8,12,10],[13,8,13,9],[14,8,14,9],[16,13,16,14],[12,13,12,15],[12,2,12,4],[13,2,13,3],[13,13,13,14],[15,8,15,9],[14,2,14,3],[14,13,14,14],[15,2,15,3],[16,2,16,3],[15,13,15,14],[25,1,25,2],[18,1,18,3],[20,1,20,2],[21,1,21,2],[22,1,22,2],[24,1,24,2],[19,1,19,3],[23,1,23,2],[11,13,11,15],[18,6,18,8],[3,7,3,9],[3,2,3,4],[11,8,11,10],[11,2,11,4],[32,1,32,2],[27,1,28,3],[29,1,29,3],[30,1,30,2],[31,1,31,2]]}
[]
[null,"Greenhouse gases"]
[]
[null,"GWP","Upper Thresholds (labtests w/o WLTC+ CAT (-7°C))",null,null,"gross excess",null,"Upper Thresholds (PEMS+ tests)",null,null,"gross excess",null,"Upper Thresholds (WLTC+ CAT (-7°C))",null,null,"gross excess"]
[]
[null,298,"N2O",10,10,{"$f":"IF(OR(Petrol,CNG_Mono,CNG_Dual),1.5*D6,IF(Diesel,1.5*E6,\"n.a.\"))","v":15},null,"N2O",{"$f":"D6*$K$10","v":15},{"$f":"E6*$K$10","v":15},{"$f":"IF(Petrol,1.5*I6,IF(Diesel,1.5*J6,\"n.a.\"))","v":22.5},null,"N2O",{"$f":"D6*$P$10","v":16},{"$f":"E6*$P$10","v":16},{"$f":"IF(Petrol,1.5*N6,IF(Diesel,1.5*O6,\"n.a.\"))","v":24}]
[null,34,"CH4",32,32,{"$f":"IF(OR(Petrol,CNG_Mono,CNG_Dual),1.5*D7,IF(Diesel,1.5*E7,\"n.a.\"))","v":48},null,"CH4",48,{"$f":"E7*$K$10","v":48},{"$f":"IF(Petrol,1.5*I7,IF(Diesel,1.5*J7,\"n.a.\"))","v":72},null,"CH4",{"$f":"D7*$P$10","v":51.2},{"$f":"E7*$P$10","v":51.2},{"$f":"IF(Petrol,1.5*N7,IF(Diesel,1.5*O7,\"n.a.\"))","v":76.800000000000011}]
[null,1,"CO2",225,225,{"$f":"IF(OR(Petrol,CNG_Mono,CNG_Dual),1.5*D8,IF(Diesel,1.5*E8,\"n.a.\"))","v":337.5},null,"CO2",{"$f":"D8","v":225},{"$f":"E8","v":225},{"$f":"IF(Petrol,1.5*I8,IF(Diesel,1.5*J8,\"n.a.\"))","v":337.5},null,"CO2",{"$f":"D8","v":225},{"$f":"E8","v":225},{"$f":"IF(Petrol,1.5*N8,IF(Diesel,1.5*O8,\"n.a.\"))","v":337.5}]
[]
[null,null,null,null,null,null,null,null,null,"CF:",1.5,null,null,null,"CF:",1.6]
{"$rows_left_out":24}
{"sheet":"WEBSITE SUMMARY","index":9,"n_rows":183,"n_cols":5,"rows_kept":183,"cut":false,"hidden":true,"merged":[[91,3,91,5],[124,3,124,5],[150,3,150,5],[151,3,151,5]]}
["Car Model",{"$f":"CONCATENATE(SPECS!B1,\" \",SPECS!B2)","v":" "},null,"Type"]
["Type",{"$f":"SPECS!B3","v":0}]
["Release Date"]
["Year of Test"]
["Start of Production",{"$f":"IF(SPECS!B34=\"\",\"\",SPECS!B34)","v":""},"New 2301","empty or date: DD/MM/YYYY","currently not in use"]
["End of Production",{"$f":"IF(SPECS!B35<=SPECS!B34,\"\",IF(SPECS!B35=\"\",\"\",SPECS!B35))","v":""},"New 2301","empty or date: DD/MM/YYYY","currently not in use"]
["Engine",{"$f":"SPECS!B6","v":"Petrol"}]
["Gearbox",{"$f":"SPECS!B23","v":0}]
["Number of Doors",{"$f":"SPECS!B25","v":0},"New 2301","Number - no decimals"]
["Emissions Class",{"$f":"SPECS!B27","v":0}]
{"$rows_left_out":174}
{"sheet":"Track Changes","index":10,"n_rows":106,"n_cols":4,"rows_kept":106,"cut":false,"hidden":true,"merged":[]}
["Version 2.0.8.2 received the following changes to adopt E85 fuel:","Damyanov",null,"29.09.2022"]
[]
["LIMITS Greenhouse"]
["·       B33 E85 fuel Upstream CO2 reduction factor due to neutral bio-fuel share combustion carbon balance = 0,214"]
["·       Row 26, added “Ethanol E85”, 1,753"]
[]
["LIMITS Efficiency"]
["·       B19 added “E10”"]
["·       B20 added “B7”"]
["·       Row added after table at line 24"]
{"$rows_left_out":96}