{"text_format":"1","workbook":"xlsx","n_sheets":18,"sheets":["OVERALL RATING (avg)","SPECS","TEST RESULTS","LCA RESULTS","Driving Experience Input","Fast charging","Clean Air","Efficiency","Greenhouse","Driving Experience","LIMITS Clean Air","LIMITS Efficiency","LIMITS Greenhouse","WEBSITE SUMMARY","Sheet1","Versions","Child vehicles","Track Changes"],"not_rendered":{"charts":0,"images":38,"macros":1,"external_links":0,"defined_names":98,"comments":0,"pivot_tables":0},"unopened":[],"bounds":{"document_bytes":16777216,"sheet_cells":100000,"rows_first":2000,"rows_last":500,"rows_between":2000,"halvings":0,"cell_chars":16384,"cell_head_chars":4096},"cells_cut":0,"cells_raw":0,"read":"whole","date_system":"1900"}

{"sheet":"OVERALL RATING (avg)","index":0,"n_rows":93,"n_cols":13,"rows_kept":93,"cut":false,"hidden":false,"merged":[[2,2,2,5],[86,3,86,4],[86,5,86,6],[86,7,86,8],[78,3,78,5],[78,6,78,8],[79,6,79,7],[80,6,80,7],[81,6,81,7],[7,3,7,4],[7,5,7,6],[7,7,7,8],[6,3,6,4],[6,5,6,6],[6,7,6,8],[24,2,28,2],[26,19,26,24],[31,3,31,4],[31,5,31,6],[31,7,31,8],[30,2,30,8],[32,3,32,4],[32,5,32,6],[32,7,32,8],[33,3,33,4],[33,5,33,6],[33,7,33,8],[34,3,34,4],[34,5,34,6],[34,7,34,8],[35,3,35,8],[52,3,52,4],[52,5,52,6],[52,7,52,8],[53,3,53,4],[53,5,53,6],[53,7,53,8],[54,3,54,4],[54,5,54,6],[54,7,54,8],[55,3,55,4],[55,5,55,6],[55,7,55,8],[56,3,56,4],[56,5,56,6],[56,7,56,8],[67,6,67,7],[67,13,67,16],[60,3,60,8],[61,4,61,5],[61,6,61,8],[62,7,62,8],[63,4,63,5],[63,6,63,8],[65,4,65,5],[65,6,65,8],[66,3,66,5],[66,6,66,8],[66,13,66,16],[73,6,73,7],[68,6,68,7],[69,6,69,7],[70,3,70,5],[70,6,70,8],[71,6,71,7],[72,6,72,7],[74,3,74,5],[74,6,74,8],[75,6,75,7],[76,6,76,7],[77,6,77,7],[87,3,87,4],[87,5,87,6],[87,7,87,8],[88,3,88,4],[88,5,88,6],[88,7,88,8]]}
[]
[]
[null,null,{"$f":"IF(E62=0,\"Make Model\",CONCATENATE(E62,\" \",G62))","v":"Make Model"}]
[]
[]
[null,null,null,"SUSTAINABILITY RATING"]
[null,null,null,"Clean Air\n",null,"Energy Efficiency\n",null,"Greenhouse Gases\n"]
[null,null,null,32.6,null,40.5]
{"$rows_left_out":86}
{"sheet":"SPECS","index":1,"n_rows":53,"n_cols":21,"rows_kept":53,"cut":false,"hidden":false,"merged":[]}
["Brand",null,"CoC p.0.1. (e.g. Mercedes-Benz)",null,null,null,null,"v1.6.6",null,null,null,"Petrol (inc hybrids)",{"$f":"IF(ICE_Type=1,TRUE,FALSE)","v":false},5,"Rating Sheet Version","Euro 6b",1]
["Model",null,"CoC p.0.2.1. (e.g. V-Class)",null,null,null,null,null,null,null,null,"Diesel (inc. hybrids)",{"$f":"IF(ICE_Type=2,TRUE,FALSE)","v":false},true,"2023.2.0.8.6","Euro 6c"]
["Variant Name",null,"Model data (e.g. V250d, 9G-Tronic, Avantgarde)",null,null,null,null,null,null,null,null,"ICE - CNG - Mono",{"$f":"IF(ICE_Type=3,TRUE,FALSE)","v":false},null,"Protocols","Euro 6d-Temp"]
["Green NCAP Test Reference Number",null,"(e.g. 20-FOR-0023)",null,null,null,null,null,null,null,null,"ICE - CNG - Dual",{"$f":"IF(ICE_Type=4,TRUE,FALSE)","v":false},null,2022,"Euro 6d"]
["Child vehicle",null,"Yes/No"]
["Production Region","Europe",null,null,null,null,null,"SELECT"]
["Drivetrain",null,"CoC p.3. (e.g. RWD)",null,null,null,null,null,null,null,null,"Hydrogen",{"$f":"IF(ICE_Type=6,TRUE,FALSE)","v":false},null,null,"Euro AX"]
["Fuel Type",{"$f":"IF(Petrol,\"Petrol\",IF(Diesel,\"Diesel\",IF(E_85,\"Ethanol E85\",IF(CNG_Dual,\"CNG\",IF(CNG_Mono,\"CNG\",IF(Hydrogen,\"Hydrogen\",IF(Electric,\"Electric\")))))))","v":"Electric"},"Taken from Selector Choice",null,null,null,null,null,null,"Respect Green NCAP's definition of \"Hybrid\".",null,"Battery Electric",{"$f":"IF(ICE_Type=5,TRUE,FALSE)","v":true}]
{"$rows_left_out":46}
{"sheet":"TEST RESULTS","index":2,"n_rows":43,"n_cols":30,"rows_kept":43,"cut":false,"hidden":false,"merged":[[29,0,40,0],[29,1,29,3],[31,1,35,1],[31,2,35,2],[36,1,40,1],[36,2,40,2],[2,0,16,0],[9,1,13,1],[4,1,8,1],[2,1,2,3],[14,1,16,1],[9,2,13,2],[14,2,14,3],[15,2,15,3],[16,2,16,3],[4,2,8,2]]}
[]
[]
[null,"MAIN RESULTS 1",null,null,"CO2\ntailpipe","CO2                RCB corr.","CO","NOx","NO","NO2","PN","PM","N2O","NH3","THC","CH4","Fuel Consumption","Energy Consumption from Grid","Fuel consumpt.","Energy consumpt.","Gas Consumption","Board Comp.\n fuel consumpt.","Board Comp.\n energy consumpt.","Board Comp.\ngas consumpt.","Driving Range\n(ICE mode)","Driving Range\n(electr. mode)","Measured Recharged Electric Energy (BEV and PHEV, from grid) ","Measured Net Battery Capacity","Efiiciency grid to battery output","Electr. energy consumpt. from battery"]
[null,null,null,null,"g/km","g/km","mg/km","mg/km","mg/km","mg/km","#/km","mg/km","mg/km","mg/km","mg/km","mg/km","l/100km","kWh/100km","g/s","Wh/s","kg/100km","l/100km","kWh/100km","kg/100km","km","km","kWh","kWh","-","kWh/100km"]
[null,"Laboratory Tests",null,"WLTP CoC Type Approval"]
[null,null,null,"WLTC+ Warm"]
[null,null,null,"WLTC+ CAT Cold (-7°C)"]
[null,null,null,"WLTC+ CAT Warm (-7°C)"]
{"$rows_left_out":36}
{"sheet":"LCA RESULTS","index":3,"n_rows":31,"n_cols":20,"rows_kept":31,"cut":false,"hidden":false,"merged":[[4,1,4,2],[4,7,4,8],[4,4,4,5]]}
[]
[null,null,null,null,null,null,null,"Replacement of generic LCA data?","No",null,null,null,null,null,null,null,null,null,null,"Yes"]
[null,"Assumed Lifetime Mileage [km]: ",{"$f":"'LIMITS Greenhouse'!C25","v":240000},null,null,null,null,"Correction Factor:",{"$f":"IF(SPECS!B6=\"\",1,IF(OR(SPECS!B6=\"Europe\",SPECS!B6=\"United Kingdom\",SPECS!B6=\"Turkey\"),1.2,IF(OR(SPECS!B6=\"United States\",SPECS!B6=\"Mexico\"),1.4,IF(OR(SPECS!B6=\"China\",SPECS!B6=\"Japan\",SPECS!B6=\"South Korea\",SPECS!B6=\"Vietnam\"),1.5,IF(SPECS!B6=\"India\",1.6,IF(SPECS!B6=\"South Africa\",1.7))))))","v":1.2},null,null,null,null,null,null,null,null,null,null,"No"]
[]
[null,"LCA Pollutants",null,null,"LCA Energy Demand",null,null,"LCA Greenhouse Gases"]
[]
[null,"Production","mg/km",null,"Phase","kWh/km",null,"Production total","g/km"]
[null,"NMVOC",null,null,"Production Total",null,null,"N2O"]
{"$rows_left_out":24}
{"sheet":"Driving Experience Input","index":4,"n_rows":109,"n_cols":11,"rows_kept":109,"cut":false,"hidden":false,"merged":[[1,0,44,0],[52,6,52,7],[45,0,77,0],[78,0,109,0]]}
[null,"ITEM","Applicability",null,"Results"]
["Consumption and Range",null,null,null,"will be filled by secretariat"]
[null,"Estimated Actual Consumption","ICE, HEV, BEV",null," l/100km or kWh/100km","Urban","Rural","Highway","Mixed"]
[null,null,null,null,"Warm weather"]
[null,null,null,null,"Cold Winter"]
[]
[]
[null,null,"PHEV",null,null,"Urban","Rural","Highway","Mixed"]
{"$rows_left_out":102}
{"sheet":"Fast charging","index":5,"n_rows":9,"n_cols":11,"rows_kept":9,"cut":false,"hidden":false,"merged":[]}
["SoC [%]","Time [mm:ss]","Power [kW]","Recharged range with consumption A [km]","Recharged range with consumption B [km]","Recharged range with consumption C [km]",null,null,null,"Test conusmption used","kWh/100km"]
[null,null,null,null,null,null,{"$f":"TEXT(INT(B2/60), \"00\") & \":\" & TEXT(MOD(B2, 60), \"00\")","v":"00:00"},null,"A","WLTC+ Warm Mixed"]
[null,null,null,null,null,null,null,null,"B","WLTC+ Warm Highway"]
[null,null,null,null,null,null,null,null,"C","WLTC+ CAT Warm Highway"]
[]
[null,null,null,null,null,null,null,null,"Recharged Range in 10 min after 10% SoC"]
[null,null,null,null,null,null,null,null,"Consumption A",null,"km"]
[null,null,null,null,null,null,null,null,"Consumption B",null,"km"]
{"$rows_left_out":2}
{"sheet":"Clean Air","index":6,"n_rows":134,"n_cols":17,"rows_kept":134,"cut":false,"hidden":false,"merged":[[23,21,23,22],[27,21,27,22],[28,21,28,22],[78,2,78,3],[78,10,78,11],[78,12,79,12],[32,21,32,22],[31,21,31,22],[29,21,29,22],[30,21,30,22],[26,21,26,22],[2,12,4,12],[13,21,14,22],[15,18,15,19],[13,18,14,20],[15,21,15,22],[13,12,15,12],[4,2,4,3],[2,1,12,1],[2,2,3,3],[2,5,3,9],[13,10,14,11],[13,5,14,9],[13,2,14,3],[2,10,3,11],[13,1,104,1],[94,2,95,3],[94,5,95,9],[105,12,107,12],[107,2,107,3],[105,1,115,1],[105,2,106,3],[15,2,15,3],[104,2,104,4],[94,10,95,11],[94,12,96,12],[96,2,96,3],[85,2,85,3],[85,10,85,11],[85,12,86,12],[140,1,143,1],[144,1,146,1],[105,5,106,9],[105,10,106,11],[148,1,156,1],[22,21,22,22],[17,21,17,22],[19,21,19,22],[20,21,20,22],[21,21,21,22],[18,21,18,22]]}
[]
[]
[null,"PRODUCTION",null,null,null,"LCA Results"]
[]
[null,null,null,null,null,null,"LCA Value","Localization Factor","Total"]
[null,null,null,"max points"]
[null,null,null,"NMVOC","mg/km",null,{"$f":"'LCA RESULTS'!C8","v":0},1,{"$f":"G7*H7","v":0},null,null,null,null,"Will have upper, lower LCA limits for all pollutants"]
[null,null,null,"NOx (NO and NO2)","mg/km",null,{"$f":"'LCA RESULTS'!C9","v":0},1,0]
{"$rows_left_out":127}
{"sheet":"Efficiency","index":7,"n_rows":46,"n_cols":32,"rows_kept":46,"cut":false,"hidden":false,"merged":[[39,9,39,10],[27,9,27,10],[118,1,126,1],[17,2,17,3],[18,2,18,3],[21,1,25,1],[21,2,21,3],[110,1,113,1],[114,1,116,1],[22,2,22,3],[23,2,23,3],[31,9,31,10],[35,9,35,10],[3,2,3,3],[1,2,1,3],[6,1,20,1],[6,2,6,4],[16,2,16,4],[2,2,2,3],[1,1,5,1],[15,2,15,3]]}
[]
[null,"PRODUCTION"]
[null,null,null,null,null,null,"LCA Value","Total"]
[]
[null,null,null,null,"kWh/100km",null,{"$f":"'LCA RESULTS'!F8*100","v":0},{"$f":"G5","v":0}]
[]
[null,"USAGE","Testing",null,null,null,null,null,null,null,null,null,null,null,null,null,null,null,null,null,null,null,null,null,null,"Conversion from l/100km or kg/100km to kWh/100km for different energy carriers"]
[null,null,null,null,"Energy Consumption","From Test","Upstream","Total",null,null,null,null,null,"2.1.2.1",null,null,"2.1.2.2",null,null,"2.1.2.3",null,null,null,"2.1.2.4",null,null,"2.1.2.5",null,null,"2.1.2.6"]
{"$rows_left_out":39}
{"sheet":"Greenhouse","index":8,"n_rows":118,"n_cols":22,"rows_kept":118,"cut":false,"hidden":false,"merged":[[94,9,95,10],[94,11,96,11],[110,3,110,5],[110,8,110,9],[115,3,115,9],[116,3,116,9],[111,3,111,5],[111,8,111,9],[112,3,112,9],[113,3,113,9],[114,3,114,9],[1,2,2,3],[1,5,2,8],[24,2,24,3],[51,2,51,3],[42,2,42,3],[13,5,14,8],[13,2,15,3],[3,2,3,3],[15,13,15,21],[25,13,25,21],[18,13,18,14],[18,16,18,17],[18,19,18,20],[78,1,86,1],[78,2,78,3],[78,5,79,8],[109,15,109,16],[16,13,16,21],[72,13,72,21],[80,2,80,3],[33,2,33,3],[108,3,108,5],[108,8,108,9],[109,3,109,5],[109,8,109,9],[100,9,101,10],[100,11,102,11],[88,9,89,10],[88,11,90,11],[4,1,12,1],[4,2,4,3],[6,2,6,3],[4,5,5,8],[69,2,71,3],[69,5,70,8],[13,1,77,1]]}
[]
[null,null,"3.Greenhouse Gas Index"]
[]
[]
[null,"PRODUCTION",null,null,null,"LCA Results"]
[]
[null,null,null,null,null,"LCA Value","CO2-eq"]
[]
{"$rows_left_out":111}
{"sheet":"Driving Experience","index":9,"n_rows":216,"n_cols":19,"rows_kept":216,"cut":false,"hidden":false,"merged":[[1,0,137,0],[138,0,179,0],[180,0,217,0]]}
[null,null,"ITEM","Applicability",null,"Assessment"]
["Consumption and Range","Total Score"]
[null,{"$f":"IF(Electric,ROUND(SUM(0.4*I20+0.4*I87+0.2*H136)/(0.4*M18+0.4*M85+0.2*L134)*3,0),IF(OR(Petrol,Diesel,CNG_Mono,E_85),ROUND(SUM(0.7*I20+0*I87+0.3*H136)/(0.7*M18+0*M85+0.3*L134)*3,0),\"?\"))","v":{"$error":"#DIV/0!"}},null,null,null,null,null,{"$f":"IF(OR(Petrol,Diesel,E_85),\"l/100km\",IF(OR(CNG_Dual,CNG_Mono,Hydrogen),\"kg/100km\",IF(Electric,\"kWh/100km\",\"?\")))","v":"kWh/100km"},null,null,"Applicable thresholds",null,"Maximum Score","thresholds l/100km",null,"thresholds kg/100km",null,"thresholds kWh/100km"]
[null,{"$f":"IF(B3<=1,\"Poor\",IF(B3<=2,\"Adequate\",IF(B3<=3,\"Good\",\"??\")))","v":{"$error":"#DIV/0!"}},"Estimated Actual Consumption","ICE, HEV, BEV",null,null,null,"value","score","grade","lower ","upper",null,"lower ","upper","lower ","upper","lower ","upper"]
[null,{"$f":"IF(B4=\"Good\",\"Green\",IF(B4=\"Adequate\",\"Yellow\",IF(B4=\"Poor\",\"Red\")))","v":{"$error":"#DIV/0!"}}]
[null,null,null,null,null,"Warm Weather","urban",{"$f":"'Driving Experience Input'!F4","v":0},{"$f":"IF(H6<=K6,3,IF(H6<=L6,2,1))","v":3},{"$f":"IF(I6=1,\"Red\",IF(I6=2,\"Yellow\",IF(I6=3,\"Green\")))","v":"Green"},{"$f":"IF(OR(Petrol,Diesel,E_85),N6,IF(OR(CNG_Dual,CNG_Mono,Hydrogen),P6,IF(Electric,R6,\"?\")))","v":15.8},19.7,3,6.4,9.1999999999999993,null,null,15.8,19.7]
[null,null,null,null,null,null,"rural",{"$f":"'Driving Experience Input'!G4","v":0},{"$f":"IF(H7<=K7,3,IF(H7<=L7,2,1))","v":3},{"$f":"IF(I7=1,\"Red\",IF(I7=2,\"Yellow\",IF(I7=3,\"Green\")))","v":"Green"},17.2,20.2,3,4.9000000000000004,6.4,null,null,17.2,20.2]
[null,null,null,null,null,null,"highway",{"$f":"'Driving Experience Input'!H4","v":0},3,"Green",19.399999999999999,23,3,5.7,7.3,null,null,19.399999999999999,23]
{"$rows_left_out":209}
{"sheet":"LIMITS Clean Air","index":10,"n_rows":102,"n_cols":24,"rows_kept":102,"cut":false,"hidden":false,"merged":[[2,18,2,22],[1,0,1,11],[3,5,3,6],[17,1,18,2],[3,1,3,2],[17,5,18,6],[3,9,3,10],[17,9,18,10],[3,13,3,15],[17,13,18,15]]}
[]
["Clean Air (Pollutants)"]
[null,null,null,null,null,null,null,null,null,null,null,null,null,null,null,null,null,null,"Upstream LCA Factors (W-t-T) mg/kWh",null,null,null,null,"Energy Source"]
[null,"Upper Thresholds (labtests \nw/o WLTC+ CAT (-7°C))",null,"gross excess",null,"Upper Thresholds\n(On-Road Drive)",null,"gross excess",null,"Upper Thresholds\n WLTC+ CAT (-7°C)\n (extended bouderies)",null,"gross excess",null,"Congestion Simulation\nUpper Thresholds",null,null,null,null,"Petrol E10","Diesel B7","Electric EU27","Hydrogen natural gas","Petrol E85",{"$f":"IF(Petrol,\"Petrol\",IF(Diesel,\"Diesel\",IF(Electric,\"Electric\",IF(Hydrogen,\"Hydrogen\",IF(E_85,\"Ethanol E85\")))))","v":"Electric"}]
[null,null,null,null,null,null,null,null,null,null,null,null,null,null,"Max","Average",null,"NMHC",145,153,32.624275877191188,189.90104569869035,83,{"$f":"IF(Petrol,S5,IF(Diesel,T5,IF(Electric,U5,\"\")))","v":32.624275877191188}]
[null,"NMHC",68,{"$f":"1.5*C6","v":102},null,"NMHC",{"$f":"C6*$H$14","v":89.76},{"$f":"1.5*G6","v":134.64000000000001},null,"NMHC",{"$f":"C6*$L$14","v":89.76},{"$f":"1.5*K6","v":134.64000000000001},null,null,"mg/s","mg/s",null,"NOx",216,207,305.9162191945058,131,363,305.9162191945058]
[null,"NOx",60,{"$f":"1.5*C7","v":90},null,"NOx",79.2,{"$f":"1.5*G7","v":118.80000000000001},null,"NOx",79.2,{"$f":"1.5*K7","v":118.80000000000001},null,"NOx",1,0.5,null,"NO2"]
[null,"NO2",20,{"$f":"1.5*C8","v":30},null,"NO2",26.400000000000002,39.6,null,"NO2",26.400000000000002,39.6,null,null,null,null,null,"NH3",46,32,2.0783638327422995,2.6998843926282095,510,2.0783638327422995]
{"$rows_left_out":95}
{"sheet":"LIMITS Efficiency","index":11,"n_rows":17,"n_cols":9,"rows_kept":17,"cut":false,"hidden":false,"merged":[[4,6,4,7],[14,1,14,4],[1,1,1,4],[4,1,4,2]]}
[]
[null,"Energy Efficiency"]
[]
[null,"Fuel / Energy Consumption Conversion Factors"]
[null,"Multiplication liquid fuel (l/100km) or gaseous fuel (kg/100km) --> energy (kWh/100km)",null,null,null,null,"LCA  Upstream Factors (W-t-W) (kWh/kWh)",null,"Relevant here"]
[null,"Energy Carrier","Factor (default)",null,null,null,{"$f":"B7","v":"Petrol E10"},1.35,{"$f":"IF(Petrol,H6,IF(Diesel,H7,IF(Electric,H9,IF(E_85,H11,IF(Hydrogen,H10,IF(CNG_Mono,H8))))))","v":2.1215999999999999}]
[null,"Petrol E10",8.64,null,null,null,"Diesel B7",1.27]
[null,"Diesel B7",9.7899999999999991,null,null,null,"CNG",1.1599999999999999]
{"$rows_left_out":10}
{"sheet":"LIMITS Greenhouse","index":12,"n_rows":25,"n_cols":4,"rows_kept":25,"cut":false,"hidden":false,"merged":[[22,1,22,2],[17,1,18,3],[19,1,19,3],[20,1,20,2],[21,1,21,2],[15,1,15,2],[8,1,8,3],[10,1,10,2],[11,1,11,2],[12,1,12,2],[14,1,14,2],[9,1,9,3],[13,1,13,2],[1,1,1,6],[3,2,3,3],[4,2,4,3],[5,2,5,3],[6,2,6,3]]}
[]
[null,"Greenhouse gases"]
[]
[null,"GWP"]
[null,298,"N2O"]
[null,34,"CH4"]
[null,1,"CO2"]
[]
{"$rows_left_out":18}
{"sheet":"WEBSITE SUMMARY","index":13,"n_rows":389,"n_cols":9,"rows_kept":389,"cut":false,"hidden":false,"merged":[]}
["Car Model",{"$f":"CONCATENATE(SPECS!B1,\" \",SPECS!B2)","v":" "},null,"Type"]
["Type",{"$f":"SPECS!B3","v":0},null,null,null,null,null,"Keep for child"]
["Country of Manufacturing",{"$f":"IF(SPECS!B6=0,\"\",SPECS!B6)","v":"Europe"},"New 2025",null,"will overwrite manual input in dashboard!",null,null,"Keep for child"]
["Start of Production",{"$f":"IF(SPECS!B42=\"\",\"\",SPECS!B42)","v":""},"New 2301","empty or date: DD/MM/YYYY","currently not in use"]
["End of Production",{"$f":"IF(SPECS!B43<=SPECS!B42,\"\",IF(SPECS!B43=\"\",\"\",SPECS!B43))","v":""},"New 2301","empty or date: DD/MM/YYYY","currently not in use"]
["Engine",{"$f":"SPECS!B8","v":"Electric"},null,null,null,null,null,"Take from basemodel"]
["Gearbox",{"$f":"SPECS!B26","v":0},null,null,null,null,null,"Take from basemodel"]
["Number of Doors",{"$f":"SPECS!B28","v":0},"New 2301","Number - no decimals",null,null,null,"obsolete if child"]
{"$rows_left_out":382}
{"sheet":"Sheet1","index":14,"n_rows":34,"n_cols":6,"rows_kept":34,"cut":false,"hidden":true,"merged":[]}
[]
["=","if('","Driving Experience Input'!$E$76","<>\"\",'",",\"\")",{"$f":"A$2&B$2&C2&D$2&C2&E$2","v":"=if('Driving Experience Input'!$E$76<>\"\",'Driving Experience Input'!$E$76,\"\")"}]
[null,null,"Driving Experience Input'!$F$76",null,null,{"$f":"A$2&B$2&C3&D$2&C3&E$2","v":"=if('Driving Experience Input'!$F$76<>\"\",'Driving Experience Input'!$F$76,\"\")"}]
[null,null,"Driving Experience Input'!$G$76",null,null,"=if('Driving Experience Input'!$G$76<>\"\",'Driving Experience Input'!$G$76,\"\")"]
[null,null,"Driving Experience Input'!$H$76",null,null,"=if('Driving Experience Input'!$H$76<>\"\",'Driving Experience Input'!$H$76,\"\")"]
[null,null,"Driving Experience'!$K$175",null,null,"=if('Driving Experience'!$K$175<>\"\",'Driving Experience'!$K$175,\"\")"]
[null,null,"Driving Experience'!$L$175",null,null,"=if('Driving Experience'!$L$175<>\"\",'Driving Experience'!$L$175,\"\")"]
[null,null,null,null,null,"=if('<>\"\",',\"\")"]
{"$rows_left_out":27}
{"sheet":"Versions","index":15,"n_rows":41,"n_cols":10,"rows_kept":41,"cut":false,"hidden":false,"merged":[]}
["Table to enter variants only (enter partner / twin information in the tab 'Child vehicles')",null,null,null,"v 260508"]
[]
["Variant","Trim addition","Engine","Drivetrain","Gearbox","Combined"]
[{"$f":"IF(Table1[[#This Row],[Trim addition]]<>\"\",SPECS!$B$3,\"\")","v":0},"e.g.: Max",{"$f":"IF(Table1[[#This Row],[Trim addition]]<>\"\",LOWER(SPECS!$B$8),\"\")","v":"electric"},{"$f":"IF(Table1[[#This Row],[Trim addition]]<>\"\",SPECS!$B$7,\"\")","v":0},{"$f":"IF(Table1[[#This Row],[Trim addition]]<>\"\",LOWER(SPECS!$B$26),\"\")","v":""},{"$f":"TRIM(IF(ISBLANK(Table1[[#This Row],[Trim addition]]),\"\",\"[Make] [Model]\"&CHAR(10)&\"<strong>\"&Table1[[#This Row],[Variant]]&\" \"&Table1[[#This Row],[Trim addition]]&\" \"&Table1[[#This Row],[Engine]]&\" \"&Table1[[#This Row],[Drivetrain]]&\" \"&Table1[[#This Row],[Gearbox]]&\"</strong>;\"))","v":"[Make] [Model]\n<strong>0 e.g.: Max electric 0 </strong>;"}]
[{"$f":"IF(Table1[[#This Row],[Trim addition]]<>\"\",SPECS!$B$3,\"\")","v":0},"e.g.: Plus",{"$f":"IF(Table1[[#This Row],[Trim addition]]<>\"\",LOWER(SPECS!$B$8),\"\")","v":"electric"},{"$f":"IF(Table1[[#This Row],[Trim addition]]<>\"\",SPECS!$B$7,\"\")","v":0},{"$f":"IF(Table1[[#This Row],[Trim addition]]<>\"\",LOWER(SPECS!$B$26),\"\")","v":""},{"$f":"TRIM(IF(ISBLANK(Table1[[#This Row],[Trim addition]]),\"\",\"[Make] [Model]\"&CHAR(10)&\"<strong>\"&Table1[[#This Row],[Variant]]&\" \"&Table1[[#This Row],[Trim addition]]&\" \"&Table1[[#This Row],[Engine]]&\" \"&Table1[[#This Row],[Drivetrain]]&\" \"&Table1[[#This Row],[Gearbox]]&\"</strong>;\"))","v":"[Make] [Model]\n<strong>0 e.g.: Plus electric 0 </strong>;"},null,null,null,{"$f":"_xlfn.TEXTJOIN(CHAR(10)&CHAR(10), TRUE, F4:F41)","v":"[Make] [Model]\n<strong>0 e.g.: Max electric 0 </strong>;\n\n[Make] [Model]\n<strong>0 e.g.: Plus electric 0 </strong>;"}]
[{"$f":"IF(Table1[[#This Row],[Trim addition]]<>\"\",SPECS!$B$3,\"\")","v":""},null,{"$f":"IF(Table1[[#This Row],[Trim addition]]<>\"\",LOWER(SPECS!$B$8),\"\")","v":""},{"$f":"IF(Table1[[#This Row],[Trim addition]]<>\"\",SPECS!$B$7,\"\")","v":""},{"$f":"IF(Table1[[#This Row],[Trim addition]]<>\"\",LOWER(SPECS!$B$26),\"\")","v":""},{"$f":"TRIM(IF(ISBLANK(Table1[[#This Row],[Trim addition]]),\"\",\"[Make] [Model]\"&CHAR(10)&\"<strong>\"&Table1[[#This Row],[Variant]]&\" \"&Table1[[#This Row],[Trim addition]]&\" \"&Table1[[#This Row],[Engine]]&\" \"&Table1[[#This Row],[Drivetrain]]&\" \"&Table1[[#This Row],[Gearbox]]&\"</strong>;\"))","v":""}]
[{"$f":"IF(Table1[[#This Row],[Trim addition]]<>\"\",SPECS!$B$3,\"\")","v":""},null,{"$f":"IF(Table1[[#This Row],[Trim addition]]<>\"\",LOWER(SPECS!$B$8),\"\")","v":""},{"$f":"IF(Table1[[#This Row],[Trim addition]]<>\"\",SPECS!$B$7,\"\")","v":""},{"$f":"IF(Table1[[#This Row],[Trim addition]]<>\"\",LOWER(SPECS!$B$26),\"\")","v":""},{"$f":"TRIM(IF(ISBLANK(Table1[[#This Row],[Trim addition]]),\"\",\"[Make] [Model]\"&CHAR(10)&\"<strong>\"&Table1[[#This Row],[Variant]]&\" \"&Table1[[#This Row],[Trim addition]]&\" \"&Table1[[#This Row],[Engine]]&\" \"&Table1[[#This Row],[Drivetrain]]&\" \"&Table1[[#This Row],[Gearbox]]&\"</strong>;\"))","v":""}]
[{"$f":"IF(Table1[[#This Row],[Trim addition]]<>\"\",SPECS!$B$3,\"\")","v":""},null,{"$f":"IF(Table1[[#This Row],[Trim addition]]<>\"\",LOWER(SPECS!$B$8),\"\")","v":""},{"$f":"IF(Table1[[#This Row],[Trim addition]]<>\"\",SPECS!$B$7,\"\")","v":""},{"$f":"IF(Table1[[#This Row],[Trim addition]]<>\"\",LOWER(SPECS!$B$26),\"\")","v":""},{"$f":"TRIM(IF(ISBLANK(Table1[[#This Row],[Trim addition]]),\"\",\"[Make] [Model]\"&CHAR(10)&\"<strong>\"&Table1[[#This Row],[Variant]]&\" \"&Table1[[#This Row],[Trim addition]]&\" \"&Table1[[#This Row],[Engine]]&\" \"&Table1[[#This Row],[Drivetrain]]&\" \"&Table1[[#This Row],[Gearbox]]&\"</strong>;\"))","v":""}]
{"$rows_left_out":34}
{"sheet":"Child vehicles","index":16,"n_rows":578,"n_cols":16,"rows_kept":578,"cut":false,"hidden":false,"merged":[]}
["Make","Model","Variant name (Type)","Vehicle class / category","Electric Engine","ICE engine","Drivetrain","Gearbox",null,"v 250731",null,null,null,null,"Make","Model"]
[null,null,null,null,null,null,{"$f":"IF(A2<>\"\", SPECS!B$7, \"\")","v":""},{"$f":"IF(A2<>\"\", SPECS!B$26, \"\")","v":""},null,"Model names are provided as reference to existing model names.","Electric Engine","BEV","electric","Fill in the highlighted cell!","AION","#1"]
[null,null,null,null,null,null,{"$f":"IF(A3<>\"\", SPECS!B$7, \"\")","v":""},{"$f":"IF(A3<>\"\", SPECS!B$26, \"\")","v":""},null,"E.g., \"BMW 1 Series\" should not also appear as \"BMW 1-Series\" to maintain consistency.",null,"hybrid","hybrid",null,"Aiways","#3"]
[null,null,null,null,null,null,{"$f":"IF(A4<>\"\", SPECS!B$7, \"\")","v":""},{"$f":"IF(A4<>\"\", SPECS!B$26, \"\")","v":""},null,"If a (new) model name is not listed, please enter it manually.",null,"hydrogen","hydrogen",null,"Alfa Romeo","#5"]
[null,null,null,null,null,null,{"$f":"IF(A5<>\"\", SPECS!B$7, \"\")","v":""},{"$f":"IF(A5<>\"\", SPECS!B$26, \"\")","v":""},null,null,null,"mild hybrid",null,null,"Alpine","001"]
[null,null,null,null,null,null,{"$f":"IF(A6<>\"\", SPECS!B$7, \"\")","v":""},{"$f":"IF(A6<>\"\", SPECS!B$26, \"\")","v":""},null,"Variant names",null,"PHEV","plug-in hybrid",null,"Aston Martin","01"]
[null,null,null,null,null,null,{"$f":"IF(A7<>\"\", SPECS!B$7, \"\")","v":""},{"$f":"IF(A7<>\"\", SPECS!B$26, \"\")","v":""},null,"For ICE models, avoid mentioning litres as unit, if it must be included, use a lower case l preceeded by a space","ICE","CNG","CNG",null,"Audi","02"]
[null,null,null,null,null,null,{"$f":"IF(A8<>\"\", SPECS!B$7, \"\")","v":""},{"$f":"IF(A8<>\"\", SPECS!B$26, \"\")","v":""},null,"Always use a dot as a decimal separator for engine size",null,"CNG-petrol","CNG-petrol",null,"BMW","07"]
{"$rows_left_out":571}
{"sheet":"Track Changes","index":17,"n_rows":161,"n_cols":4,"rows_kept":161,"cut":false,"hidden":false,"merged":[]}
["Version 2.0.8.2 received the following changes to adopt E85 fuel:","Damyanov",null,"29.09.2022"]
[]
["LIMITS Greenhouse"]
["·       B33 E85 fuel Upstream CO2 reduction factor due to neutral bio-fuel share combustion carbon balance = 0,214"]
["·       Row 26, added “Ethanol E85”, 1,753"]
[]
["LIMITS Efficiency"]
["·       B19 added “E10”"]
{"$rows_left_out":153}